{"text_format":"1","workbook":"xlsx","n_sheets":10,"sheets":["summary","cmo","#1, $","#1, %","yields","calc","out","validate","config","guide"],"not_rendered":{"charts":1,"images":0,"macros":1,"external_links":0,"defined_names":12,"comments":0,"pivot_tables":0},"unopened":[],"bounds":{"document_bytes":16777216,"sheet_cells":100000,"rows_first":2000,"rows_last":500,"rows_between":2000,"halvings":0,"cell_chars":16384,"cell_head_chars":4096},"cells_cut":0,"cells_raw":0,"read":"whole","date_system":"1900"}

{"sheet":"summary","index":0,"n_rows":26,"n_cols":24,"rows_kept":26,"cut":false,"hidden":false,"merged":[[4,4,4,7],[4,8,4,11],[4,12,4,15],[4,16,4,19]]}
[]
[null,"TAB: VALUATION SUMMARY"]
[null,null,null,null,null,null,null,null,null,null,null,null,null,null,null,null,null,null,null,null," "]
[null,{"$f":"cmo!D4","v":"PHHMC 2007-5"},null,null,{"$f":"cmo!D5","v":270000000}]
[null,null,null,null,"Total amount",null,null,null,"NPV amount",null,null,null,"Index of the first non-zero value",null,null,null,"Index of the last non-zero value"]
[null,"Price, test",{"$f":"_xll.AC.data._get( W10, \"X\", 0)","v":"tranche-name"},"balance-initial","loss-total","amortization-total","coupon-total","payout-total","loss-npv","amortization-npv","coupon-npv","payout-npv","loss-start","amortization-start","coupon-start","payout-start","loss-end","amortization-end","coupon-end","payout-end",null,"Parameter","Value"]
[null,null,"B1-B6","20,000,000","13.26","0.74","0.01","0.91","13.18","0.74","0.01","0.91","0","0","0","0","4","0","0","4",null,"field","summary"," "]
[null,null,"A1","50,000,000","0.34","13.66","0.01","62.62","0.33","13.49","0.01","62.13","0","0","0","0","23","23","0","23",null,"tranches",{"$f":"_xll.AC.data.list_x(cmo!B11:B17, 0, 1)","v":"java.util.ArrayList@Sun, 24 Jun 2018 12:50:59:682..6782663858498218361"}," "]
[null,null,"A2","20,000,000","0.40","13.60","0.01","72.89","0.38","13.41","0.01","72.32","0","0","0","0","30","30","0","30",null,"parameters",{"$f":"_xll.AC.data.map(V7:V8, W7:W8)","v":"java.util.LinkedHashMap@Sun, 24 Jun 2018 12:50:59:713..8289899477103308335"}," "]
[null,null,"A3","60,000,000","0.40","13.60","0.01","72.89","0.38","13.41","0.01","72.32","0","0","0","0","30","30","0","30",null,"summary",{"$f":"_xll.AC.finance.cmo.get(calc!$C$11, W9)","v":"java.util.ArrayList@Sun, 24 Jun 2018 12:54:18:058..7662674348735870177"}," "]
{"$rows_left_out":17}
{"sheet":"cmo","index":1,"n_rows":20,"n_cols":18,"rows_kept":20,"cut":false,"hidden":false,"merged":[]}
[]
[null,"TAB: CMO TRANCHE STRUCTURE"]
[]
[null,"Name",null,"PHHMC 2007-5",null,null,null,"mean","stdev"]
[null,"Total balance",null,{"$f":"SUM(C11:C17)","v":270000000},null,"loss rate",null,-4,0.3]
[null,"Coupon rate",null,0.01,null,"amortization rate",null,-4,0.3]
[null,"Period length (in month)",null,3]
[null,"Number of periods",null,60]
[]
[null,"Tranche Name","Outstanding Balance","Loss Parent","Loss Rank","Loss Weight","Amortization Parent","Amortization Rank","Amortization Weight",null,{"$f":"B10","v":"Tranche Name"},{"$f":"C10","v":"Outstanding Balance"},"Loss Parent","Loss Rank","Loss Weight","Amortization Parent","Amortization Rank","Amortization Weight"]
{"$rows_left_out":11}
{"sheet":"#1, $","index":2,"n_rows":69,"n_cols":27,"rows_kept":69,"cut":false,"hidden":false,"merged":[]}
[]
[null,"TAB: TRANCHE CASH FLOWS, IN $",null,null,{"$f":"cmo!D4","v":"PHHMC 2007-5"}]
[]
[null,{"$f":"config!B11","v":"field"},{"$f":"config!B20","v":"tranche-balances"},null,{"$f":"_xll.AC.data.map($B$4:$B$5, C4:C5)","v":"java.util.LinkedHashMap@Sun, 24 Jun 2018 12:50:59:714..8049974222014660387"},null," ",{"$f":"$C$4","v":"tranche-balances"},null,{"$f":"_xll.AC.data.map($B$4:$B$5, H4:H5)","v":"java.util.LinkedHashMap@Sun, 24 Jun 2018 12:50:59:715..6135572671227377768"},null," ",{"$f":"$C$4","v":"tranche-balances"},null,{"$f":"_xll.AC.data.map($B$4:$B$5, M4:M5)","v":"java.util.LinkedHashMap@Sun, 24 Jun 2018 12:50:59:714..6780898330333176502"},null," ",{"$f":"$C$4","v":"tranche-balances"},null,{"$f":"_xll.AC.data.map($B$4:$B$5, R4:R5)","v":"java.util.LinkedHashMap@Sun, 24 Jun 2018 12:50:59:715..2485336566858311935"},null," ",{"$f":"$C$4","v":"tranche-balances"},null,{"$f":"_xll.AC.data.map($B$4:$B$5, W4:W5)","v":"java.util.LinkedHashMap@Sun, 24 Jun 2018 12:50:59:715..4562315236088951072"},null," "]
[null,"tranche-name","root",null,{"$f":"_xll.AC.finance.cmo.get(calc!$C$11, E4)","v":"java.util.ArrayList@Sun, 24 Jun 2018 12:54:18:058..2846595548600205527"},null," ",{"$f":"cmo!B11","v":"B1-B6"},null,{"$f":"_xll.AC.finance.cmo.get(calc!$C$11, J4)","v":"java.util.ArrayList@Sun, 24 Jun 2018 12:54:18:057..8570943505577536692"},null," ",{"$f":"cmo!B16","v":"A5.1"},null,{"$f":"_xll.AC.finance.cmo.get(calc!$C$11, O4)","v":"java.util.ArrayList@Sun, 24 Jun 2018 12:54:18:053..4677961734121925276"},null," ",{"$f":"cmo!B17","v":"A5.2"},null,{"$f":"_xll.AC.finance.cmo.get(calc!$C$11, T4)","v":"java.util.ArrayList@Sun, 24 Jun 2018 12:54:18:052..7735105709803203858"},null," ",{"$f":"cmo!B19","v":"A1-A3"},null,{"$f":"_xll.AC.finance.cmo.get(calc!$C$11, Y4)","v":"java.util.ArrayList@Sun, 24 Jun 2018 12:54:18:052..4556521178850083531"},null," "]
[null,null,null,null,{"$f":"_xll.AC.data.size(E5, 1)","v":4},{"$f":"_xll.AC.data.size(E5, 2)","v":60}]
[null,null,null,{"$f":"SUM(D10:D500)","v":46609803.902006954},{"$f":"SUM(E10:E500)","v":1250174497.7714028},{"$f":"SUM(F10:F500)","v":2529825502.2285976},null,null,{"$f":"SUM(I10:I500)","v":200000},265172840.50840375,14827159.491596259,null,null,{"$f":"SUM(N10:N500)","v":100000},371866.38041871623,139628133.61958128,null,null,{"$f":"SUM(S10:S500)","v":318668271.23596472},423312729.88991839,-2477601412.8709726,null,null,{"$f":"SUM(X10:X500)","v":1300000},48928409.561175264,1704740901.9879754]
[null,"Period","Balance","Coupon","Losses","Amortization",null,{"$f":"C8","v":"Balance"},{"$f":"D8","v":"Coupon"},{"$f":"E8","v":"Losses"},{"$f":"F8","v":"Amortization"},null,{"$f":"H8","v":"Balance"},{"$f":"I8","v":"Coupon"},{"$f":"J8","v":"Losses"},{"$f":"K8","v":"Amortization"},null,{"$f":"M8","v":"Balance"},{"$f":"N8","v":"Coupon"},{"$f":"O8","v":"Losses"},{"$f":"P8","v":"Amortization"},null,{"$f":"R8","v":"Balance"},{"$f":"S8","v":"Coupon"},{"$f":"T8","v":"Losses"},{"$f":"U8","v":"Amortization"}]
[null,0,{"$f":"cmo!D5","v":270000000},null,null,null,null,{"$f":"VLOOKUP(H5, cmo!$B$11:$C$20, 2, FALSE)","v":20000000},null,null,null,null,{"$f":"VLOOKUP(M5, cmo!$B$11:$C$20, 2, FALSE)","v":10000000},null,null,null,null,{"$f":"VLOOKUP(R5, cmo!$B$11:$C$20, 2, FALSE)","v":10000000},null,null,null,null,{"$f":"VLOOKUP(W5, cmo!$B$11:$C$20, 2, FALSE)","v":130000000}]
[null,1,{"$f":"_xll.AC.data._get(E5, \"\", 1)","v":256510761.42001721},2700000,72419767.117652386,116429573.00210674,null,{"$f":"_xll.AC.data._get(J5, \"\", 1)","v":0},200000,235518521.52521122,14827159.491596259,null,{"$f":"_xll.AC.data._get(O5, \"\", 1)","v":0},100000,308274.55562606826,133908501.83873284,null,{"$f":"_xll.AC.data._get(T5, \"\", 1)","v":692347782.80256522},100000,308274.55562606826,-2656232093.0680256,null,{"$f":"_xll.AC.data._get(Y5, \"\", 1)","v":0},1300000,4007569.2231388949,1258459435.7519419]
{"$rows_left_out":60}
{"sheet":"#1, %","index":3,"n_rows":69,"n_cols":27,"rows_kept":69,"cut":false,"hidden":false,"merged":[[6,5,6,6]]}
[]
[null,"TAB: TRANCHE CASH FLOWS, IN %",null,null,{"$f":"'#1, $'!E2","v":"PHHMC 2007-5"}]
[]
[]
[null,null,{"$f":"'#1, $'!C5","v":"root"},null,null,null,null,null,{"$f":"'#1, $'!H5","v":"B1-B6"},null,null,null,null,{"$f":"'#1, $'!M5","v":"A5.1"},null,null,null,null,{"$f":"'#1, $'!R5","v":"A5.2"},null,null,null,null,{"$f":"'#1, $'!W5","v":"A1-A3"}]
[null,null,null,null,null,{"$f":"cmo!D8","v":60}]
[null,null,null,null,null,{"$f":"'#1, $'!F8","v":"Amortization"}]
[null,{"$f":"'#1, $'!B8","v":"Period"},{"$f":"'#1, $'!C8","v":"Balance"},{"$f":"'#1, $'!D8","v":"Coupon"},{"$f":"'#1, $'!E8","v":"Losses"},"planned","prepaid",null,{"$f":"C8","v":"Balance"},{"$f":"D8","v":"Coupon"},{"$f":"E8","v":"Losses"},{"$f":"F7","v":"Amortization"},null,{"$f":"'#1, $'!H8","v":"Balance"},{"$f":"'#1, $'!I8","v":"Coupon"},{"$f":"'#1, $'!J8","v":"Losses"},{"$f":"'#1, $'!K8","v":"Amortization"},null,{"$f":"'#1, $'!M8","v":"Balance"},{"$f":"'#1, $'!N8","v":"Coupon"},{"$f":"'#1, $'!O8","v":"Losses"},{"$f":"'#1, $'!P8","v":"Amortization"},null,{"$f":"'#1, $'!R8","v":"Balance"},{"$f":"'#1, $'!S8","v":"Coupon"},{"$f":"'#1, $'!T8","v":"Losses"},{"$f":"'#1, $'!U8","v":"Amortization"}]
[null,{"$f":"'#1, $'!B9","v":0},{"$f":"'#1, $'!C9/'#1, $'!C$9","v":1},null,null,null,null,null,{"$f":"'#1, $'!H9/'#1, $'!$C9","v":7.407407407407407E-2},null,null,null,null,{"$f":"'#1, $'!M9/'#1, $'!$C9","v":3.7037037037037035E-2},null,null,null,null,{"$f":"'#1, $'!R9/'#1, $'!$C9","v":3.7037037037037035E-2},null,null,null,null,{"$f":"'#1, $'!W9/'#1, $'!$C9","v":0.48148148148148145}]
[null,{"$f":"'#1, $'!B10","v":1},{"$f":"'#1, $'!C10/'#1, $'!C$9","v":0.95003985711117489},{"$f":"'#1, $'!D10/'#1, $'!C9","v":0.01},{"$f":"'#1, $'!E10/('#1, $'!C9-'#1, $'!D10)","v":0.27093066635859481},{"$f":"E10 / ((1+E10)^($F$6-B9)-1)","v":1.5330166593947559E-7},{"$f":"'#1, $'!F10/('#1, $'!C9-'#1, $'!D10) - F10","v":0.43557625149484264},null,{"$f":"IF('#1, $'!H9=0, \"\", '#1, $'!H10/'#1, $'!$C10)","v":0},{"$f":"IF('#1, $'!H9=0, \"\", '#1, $'!I10/'#1, $'!$D10)","v":7.407407407407407E-2},{"$f":"IF('#1, $'!H9-'#1, $'!I10=0, \"\", '#1, $'!J10/('#1, $'!H9-'#1, $'!I10))","v":11.894874824505617},{"$f":"IF('#1, $'!H9=0, \"\", '#1, $'!K10/'#1, $'!$F10)","v":0.1273487406101538},null,{"$f":"IF('#1, $'!M9=0, \"\", '#1, $'!M10/'#1, $'!$C10)","v":0},{"$f":"IF('#1, $'!M9=0, \"\", '#1, $'!N10/'#1, $'!$D10)","v":3.7037037037037035E-2},{"$f":"IF('#1, $'!M9-'#1, $'!N10=0, \"\", '#1, $'!O10/('#1, $'!M9-'#1, $'!N10))","v":3.1138844002633156E-2},{"$f":"IF('#1, $'!M9=0, \"\", '#1, $'!P10/'#1, $'!$F10)","v":1.1501244777073074},null,{"$f":"IF('#1, $'!R9=0, \"\", '#1, $'!R10/'#1, $'!$C10)","v":2.6990983885814344},{"$f":"IF('#1, $'!R9=0, \"\", '#1, $'!S10/'#1, $'!$D10)","v":3.7037037037037035E-2},{"$f":"IF('#1, $'!R9-'#1, $'!S10=0, \"\", '#1, $'!T10/('#1, $'!R9-'#1, $'!S10))","v":3.1138844002633156E-2},{"$f":"IF('#1, $'!R9=0, \"\", '#1, $'!U10/'#1, $'!$F10)","v":-22.814067118668916},null,{"$f":"IF('#1, $'!W9=0, \"\", '#1, $'!W10/'#1, $'!$C10)","v":0},{"$f":"IF('#1, $'!W9=0, \"\", '#1, $'!X10/'#1, $'!$D10)","v":0.48148148148148145},{"$f":"IF('#1, $'!W9-'#1, $'!X10=0, \"\", '#1, $'!Y10/('#1, $'!W9-'#1, $'!X10))","v":3.1138844002633215E-2},{"$f":"IF('#1, $'!W9=0, \"\", '#1, $'!Z10/'#1, $'!$F10)","v":10.808761067337855}]
{"$rows_left_out":60}
{"sheet":"yields","index":4,"n_rows":247,"n_cols":15,"rows_kept":247,"cut":false,"hidden":false,"merged":[]}
[]
[null,"TAB: DISCOUNT FACTORS, FORWARD LIBOR RATES, AND FLOATING COUPON PAYMENTS"]
[]
[null,"Discount factors:",null,null,{"$f":"_xll.AC.data.list_x(OFFSET(I8, 0, 0, COUNT(I8:I300), 1), 1, 1)","v":"java.util.ArrayList@Sun, 24 Jun 2018 12:50:55:461..6427654618439067051"},null,null,null,null," "]
[null,"Source: Bloomberg, ",null,null,null,null,"Time period (in month)",null,3,null,"Source: Bloomberg SWPM tool",null,null,null,"Coupon payments"]
[null,"maturity","treasury rate",null,"Month index","Interpolated treasury rate","Discount factor (Monthly)",{"$f":"E6","v":"Month index"},"Discount factor",null,"Month index","Date","Projected 1-month Libor",null,{"$f":"K6","v":"Month index"}]
[null,0.25,2,null,0,{"$f":"F10 - (F13-F10)","v":0.02},1,0,{"$f":"OFFSET($G$7, I$5*H7, 0)","v":1},null,{"$f":"E7","v":0},null,null,null,{"$f":"K7","v":0}]
[null,0.5,2,null,{"$f":"E7+1","v":1},{"$f":"F7*2/3+F10*1/3","v":0.02},{"$f":"G7*2/3+G10*1/3","v":0.99834983498349827},{"$f":"H7+1","v":1},{"$f":"OFFSET($G$7, I$5*H8, 0)","v":0.99504950495049505},null,{"$f":"E8","v":1},null,null,null,{"$f":"K8","v":1}]
[null,1,2,null,{"$f":"E8+1","v":2},{"$f":"F7*1/3+F10*2/3","v":0.02},{"$f":"G7*1/3+G10*2/3","v":0.99669966996699677},{"$f":"H8+1","v":2},0.99009900990099009,null,2,null,null,null,2]
[null,2,2,null,3,{"$f":"C7/100","v":0.02},{"$f":"AVERAGE(G7, G13)","v":0.99504950495049505},3,0.98519752965395546,null,3,null,null,null,3]
{"$rows_left_out":238}
{"sheet":"calc","index":5,"n_rows":33,"n_cols":7,"rows_kept":33,"cut":false,"hidden":false,"merged":[]}
[]
[null,"TAB: CMO CALCULATOR"]
[]
[null,"CMO Calculator objects",null,null,"CMO Functions"]
[]
[null,"Sample size",0,null,"Function parameters"]
[null,null,null,null,"arg-x","loss-rate"]
[null,null,null,null,"arg-y","tranche-price"]
[null,"Name",{"$f":"cmo!D4","v":"PHHMC 2007-5"},null,"name-tranche",{"$f":"cmo!B16","v":"A5.1"}]
[null,"CMO Object",{"$f":"_xll.AC.finance.cmo.model(cmo!D4, cmo!D6, cmo!D8, cmo!B11:I20)","v":"jeconkr.finance.FSTP.lib.model.cmo.CMO@Sun, 24 Jun 2018 12:50:59:765..6560790286919917282"}," ",{"$f":"_xll.AC.data.map(E7:E9, F7:F9)","v":"java.util.LinkedHashMap@Sun, 24 Jun 2018 12:50:59:682..4133231790662887917"},null," "]
{"$rows_left_out":24}
{"sheet":"out","index":6,"n_rows":25,"n_cols":25,"rows_kept":25,"cut":false,"hidden":false,"merged":[]}
[]
[null,"TAB: CMO TRANCHE STRUCTURE OUTPUT",null,null,null,{"$f":"config!B10","v":"ranking"},{"$f":"config!B14","v":"ranking-loss"},null,null,{"$f":"F2","v":"ranking"},{"$f":"config!B15","v":"ranking-amortization"}]
[null,null,null,null,null,{"$f":"config!B11","v":"field"},{"$f":"config!B16","v":"cmo-structure"},null,null,{"$f":"F3","v":"field"},{"$f":"G3","v":"cmo-structure"}]
[null,null,null,null,null,{"$f":"config!B12","v":"period"},7,null,null,{"$f":"F4","v":"period"},{"$f":"G4","v":7}]
[null,null,null,null,null,"Loss-ranking:",{"$f":"_xll.AC.data.map(F2:F4, G2:G4)","v":"java.util.LinkedHashMap@Sun, 24 Jun 2018 12:50:59:858..1562710132011837713"},null," ","Amortization-ranking:",{"$f":"_xll.AC.data.map(J2:J4, K2:K4)","v":"java.util.LinkedHashMap@Sun, 24 Jun 2018 12:50:59:858..6900393333470424505"},null," ",null,null,null," ",null,null,null,null,null,null,null," "]
[]
[null,{"$f":"cmo!D4","v":"PHHMC 2007-5"}]
[]
[null,"Output object",{"$f":"_xll.AC.finance.cmo.get(calc!$C$10, G5)","v":"java.util.ArrayList@Sun, 24 Jun 2018 12:50:59:859..3894293974771873218"},null," ",{"$f":"_xll.AC.finance.cmo.get(calc!$C$10, K5)","v":"java.util.ArrayList@Sun, 24 Jun 2018 12:50:59:859..6882225664108132992"},null,null," ",null,null,null," ",null,null,null," "]
[null,"Dimension",{"$f":"_xll.AC.data.size(C9, 1)","v":7},{"$f":"_xll.AC.data.size(C9, 2)","v":2},null,{"$f":"_xll.AC.data.size(F9, 1)","v":7},{"$f":"_xll.AC.data.size(F9, 2)","v":3}]
{"$rows_left_out":16}
{"sheet":"validate","index":7,"n_rows":19,"n_cols":10,"rows_kept":19,"cut":false,"hidden":false,"merged":[]}
[]
[null,"TAB: CMO STRUCTURE VALIDATION"]
[null,"Validates (i) consistency of CMO child/parent balances; (ii) consistency of CMO balances with respect to losses / prepaid amortization ranking structure"]
[]
[null,{"$f":"cmo!D4","v":"PHHMC 2007-5"}]
[null,"Logs",{"$f":"_xll.AC.finance.cmo.validate(calc!C11)","v":"java.util.ArrayList@Sun, 24 Jun 2018 12:54:18:056..8956914243305320219"},null,null," ",null," ",null," "]
[null,{"$f":"_xll.AC.data.size(C6, 1)","v":305}]
[]
[null,"#","log"]
[null,1,{"$f":"_xll.AC.data._get(C6, \"\", 0)","v":"Error: Tranche 'root' balance is not balanced in period 1: 256,510,761 not equal 692,347,783;"}]
{"$rows_left_out":10}
{"sheet":"config","index":8,"n_rows":22,"n_cols":8,"rows_kept":22,"cut":false,"hidden":false,"merged":[]}
[]
[null,"TAB: CONFIGURATION FILE",null,null,"Calculation enabled",null,true]
[]
[]
[null,"Test connection",{"$f":"_xll.AC.test.connection()","v":"host: home-pc; user: Konstantin Rybakov; key: null"}]
[]
[null,"Keys to retrieve output objects",null,null,"Configuration parameters for output arrays"]
[]
[null,"Key","Description",null,"Cell address","Row count","Col count","Comment"]
[null,"ranking","Key for CMO ranking name",null,{"$f":"addressFla(out!B13)","v":"'out'!$B$13"},{"$f":"out!C10","v":7},{"$f":"out!D10","v":2},"Loss ranking of CMO #1"]
{"$rows_left_out":13}
{"sheet":"guide","index":9,"n_rows":2,"n_cols":2,"rows_kept":2,"cut":false,"hidden":false,"merged":[[1,1,32,8]]}
[]
[null,"Package: CMO\n\nAvailable functions:\n\n1.     CMO cmo-object = cmo(name, coupon-rate, number-of-periods, loss/amortization-ranking-structure);\nThe function creates an instance of CMO object\nSetting the ranking structure:\n1. If the alocation weights are set for the tranches, the weights-based ranking is applied to determine allocation of balances;\n2. If weights are not set, butranking is specified (each rank is described by an integer value), then hierarchial ranking is applied;\n3. If neither weights nor hierarchial ranking is set, then the default pro-rata ranking is applied. \n\n2.     CalculatorCMO cmo-calculator = calc(cmo-object, discount-factors, loss-rate-mean, loss-rate-stdev, amort-rate-mean, amort-rate-stdev);\nThe function creates an instance of the calculator and performes calculatins. \nMean and standard deviation of loss rates are calculated based on ratios of historical losses to outstanding balances at the beginning of the period;\nMean and standard deviation of prepaid amortization rates are calculated based on ratios of historical amortization adjusted for calculated planned amortization to outstanding balances at the end of the period but prior to prepaid amortization adjustment;\n\nNotes:\n\nBalance allocation order:\n     1. First losses are allocated to the tranches based on the loss-ranking structure;\n     2. Then coupon is paid based on outstanding balances;\n     3. Finally, amortization of the balances is performed (planned and prepaid);\n"]