{"text_format":"1","workbook":"xlsx","n_sheets":14,"sheets":["summary","params","ylds","sample","tree","cf","charts","value","bullet","action","D","validate","config","guide"],"not_rendered":{"charts":7,"images":6,"macros":1,"external_links":0,"defined_names":23,"comments":0,"pivot_tables":0},"unopened":[],"bounds":{"document_bytes":16777216,"sheet_cells":100000,"rows_first":2000,"rows_last":500,"rows_between":2000,"halvings":0,"cell_chars":16384,"cell_head_chars":4096},"cells_cut":0,"cells_raw":0,"read":"whole","date_system":"1900"}

{"sheet":"summary","index":0,"n_rows":40,"n_cols":14,"rows_kept":40,"cut":false,"hidden":false,"merged":[]}
[]
[null,"TAB: SUMMARY OF THE RESULTS",null,null,null,null,null,null,null,"BOND SCHEDULES"]
[]
[null,"Model Parameters",null,null,null,"Model Output Summary",null,null,null,"Bond option parameters"]
[null,{"$f":"J5","v":"Parameter"},{"$f":"L5","v":"Value"},{"$f":"M5","v":"Description"},null,{"$f":"J5","v":"Parameter"},null,{"$f":"L5","v":"Value"},null,"Parameter",null,"Value","Description"]
[null,"Interest rate model",{"$f":"B35","v":"Hull-White, extended Vasicek"},null,null,"Bond actual value",null,{"$f":"tree!I44","v":-99.051478492542074},null,{"$f":"config!B64","v":"option"},null,{"$f":"B39","v":"call"},"Option type (put or call)"]
[null,"Valuation date","2019-01-01",null,null,"Bond bullet value",null,{"$f":"tree!I45","v":-99.999999999999986}]
[null,"credit rating","BB-","Bond transaction-specific credit rating",null,"Bond option value",null,{"$f":"H6-H7","v":0.94852150745791164},null,"Bond redemption premium / discount"]
{"$rows_left_out":33}
{"sheet":"params","index":1,"n_rows":501,"n_cols":19,"rows_kept":501,"cut":false,"hidden":false,"merged":[[19,4,19,6],[19,7,19,10]]}
[]
[null,"TAB: OPTION PARAMETERS ESTIMATION"]
[]
[null,"Yield series","Volatility series",null,"Parameter",null,"Value",null,"Description"]
[null,{"$f":"IF(ylds!C6=\"\", \"\", ylds!C6/100)","v":3.066E-2},{"$f":"_xll.AC.data._get(I47, \"\", 0)","v":4.1998736694471754E-3},null,"Model",null,{"$f":"summary!C6","v":"Hull-White, extended Vasicek"}]
[null,{"$f":"IF(ylds!C7=\"\", \"\", ylds!C7/100)","v":3.0379999999999997E-2},4.1499435599299719E-3,null,{"$f":"config!B43","v":"tenor-term-structure"},null,{"$f":"MAX(10, summary!C9)","v":10},null,"Tenor for ϑ calibration"]
[null,{"$f":"IF(ylds!C8=\"\", \"\", ylds!C8/100)","v":3.0130000000000001E-2},4.198371466011909E-3,null,{"$f":"config!B44","v":"sample-size"},null,250,null,"Sample size in number of business days"]
[null,{"$f":"IF(ylds!C9=\"\", \"\", ylds!C9/100)","v":2.9919999999999999E-2},4.2764680858647054E-3,null,{"$f":"config!B45","v":"sample-size-min"},null,30]
{"$rows_left_out":494}
{"sheet":"ylds","index":2,"n_rows":313,"n_cols":17,"rows_kept":313,"cut":false,"hidden":false,"merged":[]}
[]
[null,"TAB: MARKET YIELD RATES",null,null,{"$f":"summary!C8 & \" SERIES\"","v":"BB- SERIES"}]
[]
[null,null,"3m Index","6m Index","1Y Index","2Y Index","3Y Index","4Y Index","5Y Index","7Y Index","8Y Index","9Y Index","10Y Index","15Y Index","20Y Index","25Y Index","30Y Index"]
[null,"Date",0.25,0.5,1,2,3,4,5,7,8,9,10,15,20,25,30]
[null,"2018-03-26",3.0659999999999998,3.0659999999999998,3.18,3.3940000000000001,3.802,4.181,4.4939999999999998,4.7880000000000003,5.3019999999999996,5.4980000000000002,5.6680000000000001,5.843,6.5780000000000003]
[null,"2018-03-23",3.0379999999999998]
[null,"2018-03-22",3.0129999999999999]
{"$rows_left_out":306}
{"sheet":"sample","index":3,"n_rows":50,"n_cols":20,"rows_kept":50,"cut":false,"hidden":false,"merged":[]}
[]
[null,"TAB: OPTION CALCULATION FOR A SAMPLE OF BONDS/NOTES"]
[null,null,null,null,null,null,null,null,null,null,null,null,null,null,null,null,null,null,null," "]
[null,"Assumptions:",null,null,null,null,null,null,null,null,"Parameters",null,null,null,null,null,null,null,null," "]
[null,1,"The same interest rate tree (same volatility and other parameters) is used for each option calulation",null,null,null,null,null,null,null,"maturity term",null,{"$f":"summary!C9","v":5},"Bond sample parameters",null,null,{"$f":"_xll.AC.data.listmap(K12:M12, OFFSET(K13, 0, 0, D10, 3), 0)","v":"java.util.ArrayList@Thu, 7 Feb 2019 12:29:29:981..4187034038671082771"},null,{"$f":"_xll.AC.data.size(Q5, 1)","v":10}," "]
[null,2,"The coupon rate and coupon frequency of the Covered Transaction are used for each option calculation",null,null,null,null,null,null,null,"annuity adjustment",null,{"$f":"summary!H11","v":4.4495062780966697},"Bond sample prices",null,null,{"$f":"_xll.AC.finance.srm.get(tree!I28, config!B23, )","v":"java.util.ArrayList@Thu, 7 Feb 2019 12:29:30:659..4638517000317937004"},null,{"$f":"_xll.AC.data.size(Q6, 1)","v":10}," "]
[null,3,"Effectively terms of each bond in the sample are adjusted to the terms of Covered Transaction but assumed ",null,null,null,null,null,null,null,"Valuation Date",null,{"$f":"summary!C7","v":"2019-01-01"}]
[null,null,"to have bond-specific prepayment penalty structure",null,null,null,null,null,null,null,{"$f":"config!B64","v":"option"},null,{"$f":"config!G44","v":"call"}]
{"$rows_left_out":43}
{"sheet":"tree","index":4,"n_rows":53,"n_cols":16,"rows_kept":53,"cut":false,"hidden":false,"merged":[[3,1,3,5],[3,7,3,10]]}
[]
[null,"TAB: INTEREST RATE TREE PARAMETERS"]
[]
[null,"Interest rate process",null,null,null,null,null,"Interest rate calculator"]
[]
[null,"Process parameters",null,null,null,null,null,"Calculator parameters"]
[null,"State parameter","Value",null,null,"Description",null,"Calculator option parameter","Value",null,"Description"]
[null,{"$f":"config!B51","v":"maturity"},{"$f":"summary!C9","v":5},null,null,{"$f":"summary!D9","v":"Bond maturity term"},null,{"$f":"config!B64","v":"option"},{"$f":"summary!L6","v":"call"},null,{"$f":"config!C64","v":"Evaluated option (put or call)"}]
{"$rows_left_out":46}
{"sheet":"cf","index":5,"n_rows":71,"n_cols":19,"rows_kept":71,"cut":false,"hidden":false,"merged":[[3,1,3,5],[3,9,3,16]]}
[]
[null,"TAB: BOND INTEREST AND PRINCIPAL PAYMENTS CASH FLOWS"]
[]
[null,"Bond cash flows inputs",null,null,null,null,null,null,null,"Bond cash flows output"]
[]
[null,"Parameter","Value",null,null,"Description",null,null,null,"period","time","principal outstanding","principal paid","interest accrued","interest paid","Total amount paid","Redemption value","Coupon base","Principal base"]
[null,{"$f":"config!B10","v":"period-start"},0,null,null,null,null,null,null,0,{"$f":"IF(J7=\"\", \"\", J7*$C$14)","v":0},{"$f":"_xll.AC.data._get(B26, \"\", 0)","v":100},0,0,0,0,100,0,0]
[null,{"$f":"summary!B9","v":"maturity term"},{"$f":"summary!C9","v":5},null,null,"Bond maturity in years",null,null," ",{"$f":"IF(J7=\"\", \"\", IF(J7+1>$C$10, \"\", J7+1))","v":1},0.25,100,0,1.0895268395133282,0,0,101.08952683951333,0,0]
{"$rows_left_out":64}
{"sheet":"charts","index":6,"n_rows":101,"n_cols":21,"rows_kept":101,"cut":false,"hidden":false,"merged":[]}
[]
[null,"TAB: CHARTS"]
[]
[null,"State distribution at maturity",null,null,null,"Option exercise action switch state",null,null,null,null,null,null,null,"Charts"]
[]
[null,"number of periods",null,{"$f":"cf!C9+1","v":21},null,"Mean:",{"$f":"SUMPRODUCT(C10:C198, D10:D198)","v":6.4700512719910355E-2},null,{"$f":"summary!B12","v":"dt"},{"$f":"summary!C12","v":0.25}]
[null,"number of observations",null,{"$f":"tree!C16","v":20},null,"StDev:",{"$f":"SQRT(SUMPRODUCT(C10:C198, C10:C198, D10:D198) - G6*G6)","v":1.6877196759970018E-2}]
[]
{"$rows_left_out":94}
{"sheet":"value","index":7,"n_rows":87,"n_cols":45,"rows_kept":87,"cut":false,"hidden":false,"merged":[[4,4,4,44],[6,2,86,2]]}
[]
[null,"Bond value in the presence of the option (full value including accrued interest)"]
[]
[]
[null,null,null,null,"time period"]
[null,"#",null,null,0,{"$f":"E6+1","v":1},{"$f":"F6+1","v":2},{"$f":"G6+1","v":3},4,5,{"$f":"J6+1","v":6},{"$f":"K6+1","v":7},{"$f":"L6+1","v":8},{"$f":"M6+1","v":9},{"$f":"N6+1","v":10},{"$f":"O6+1","v":11},{"$f":"P6+1","v":12},{"$f":"Q6+1","v":13},{"$f":"R6+1","v":14},{"$f":"S6+1","v":15},{"$f":"T6+1","v":16},{"$f":"U6+1","v":17},{"$f":"V6+1","v":18},{"$f":"W6+1","v":19},{"$f":"X6+1","v":20},{"$f":"Y6+1","v":21},{"$f":"Z6+1","v":22},{"$f":"AA6+1","v":23},{"$f":"AB6+1","v":24},{"$f":"AC6+1","v":25},{"$f":"AD6+1","v":26},{"$f":"AE6+1","v":27},{"$f":"AF6+1","v":28},{"$f":"AG6+1","v":29},{"$f":"AH6+1","v":30},{"$f":"AI6+1","v":31},{"$f":"AJ6+1","v":32},{"$f":"AK6+1","v":33},{"$f":"AL6+1","v":34},{"$f":"AM6+1","v":35},{"$f":"AN6+1","v":36},{"$f":"AO6+1","v":37},{"$f":"AP6+1","v":38},{"$f":"AQ6+1","v":39},{"$f":"AR6+1","v":40}]
[null,1,"state",{"$f":"_xll.AC.stats.markov.getCalc(tree!I27, config!B54)","v":2.9718027807762171E-3},{"$f":"_xll.AC.finance.srm.get( tree!I27, config!G53)","v":""},"","",-101.08952683951333,-102.17905367902665,-101.08952683951333,-102.17905367902665,-101.08952683951333,-102.17905367902665,-101.08952683951333,-102.17905367902665,-101.08952683951333,-102.17905367902665,-101.08952683951333,-102.17905367902665,-101.08952683951333,-102.17905367902665,-101.08952683951333,-102.17905367902665,-101.08952683951333,-102.17905367902665]
[null,{"$f":"B7+1","v":2},null,8.5094422246209736E-3,"","",-102.17905367902665,-101.08952683951333,-102.17905367902665,-101.08952683951333,-102.17905367902665,-101.08952683951333,-102.17905367902665,-101.08952683951333,-102.17905367902665,-101.08952683951333,-102.17905367902665,-101.08952683951333,-102.17905367902665,-101.08952683951333,-102.17905367902665,-101.08952683951333,-102.17905367902665,-101.08952683951333,-102.17905367902665]
{"$rows_left_out":80}
{"sheet":"bullet","index":8,"n_rows":87,"n_cols":45,"rows_kept":87,"cut":false,"hidden":false,"merged":[[4,4,4,44],[6,2,86,2]]}
[]
[null,"Bond value in the presence of the option (full value including accrued interest)"]
[]
[]
[null,null,null,null,"time period"]
[null,"#",null,null,0,{"$f":"E6+1","v":1},{"$f":"F6+1","v":2},{"$f":"G6+1","v":3},4,5,6,7,8,9,10,11,12,13,14,15,16,17,18,19,20,21,22,23,24,25,26,27,28,29,30,31,32,{"$f":"AK6+1","v":33},{"$f":"AL6+1","v":34},{"$f":"AM6+1","v":35},{"$f":"AN6+1","v":36},{"$f":"AO6+1","v":37},{"$f":"AP6+1","v":38},{"$f":"AQ6+1","v":39},{"$f":"AR6+1","v":40}]
[null,1,"state",{"$f":"IF(value!D7=\"\", \"\", value!D7)","v":2.9718027807762171E-3},{"$f":"_xll.AC.finance.srm.get(tree!I27, config!G54)","v":""},"","",-111.34401626041422,-112.06416543410644,-110.43694430021189,-111.00158396226556,-109.42024521059436,-110.09885971499276,-109.32515522199867,-110.57685712404172,-109.45143360335965,-110.23571819852616,-108.08688246058583,-108.10823983200279,-105.94009130817896,-105.93954170390079,-104.06191477699355,-104.26288772142567,-102.18325138415314,-102.17905367902665]
[null,{"$f":"B7+1","v":2},null,{"$f":"IF(value!D8=\"\", \"\", value!D8)","v":8.5094422246209736E-3},"","",-110.80746470162664,-109.8084975949303,-110.93846780951208,-109.28812980522056,-109.79343321299301,-108.07265605381386,-108.43485802494811,-107.8147205880818,-109.25365364180553,-108.36988024719591,-109.49148055686408,-107.38982160412446,-107.46111268726351,-105.33944009874484,-105.37709813588654,-103.63928081704023,-103.98167665829106,-102.0418857598723,-102.17905367902665]
{"$rows_left_out":80}
{"sheet":"action","index":9,"n_rows":87,"n_cols":45,"rows_kept":87,"cut":false,"hidden":false,"merged":[[4,4,4,44],[6,2,86,2]]}
[]
[null,"Option exercise action function"]
[]
[]
[null,null,null,null,"time period"]
[null,"#",null,null,0,{"$f":"E6+1","v":1},{"$f":"F6+1","v":2},{"$f":"G6+1","v":3},{"$f":"H6+1","v":4},{"$f":"I6+1","v":5},{"$f":"J6+1","v":6},7,8,9,10,11,12,13,14,15,16,17,18,19,20,21,22,23,24,25,26,27,28,29,30,31,32,{"$f":"AK6+1","v":33},{"$f":"AL6+1","v":34},{"$f":"AM6+1","v":35},{"$f":"AN6+1","v":36},{"$f":"AO6+1","v":37},{"$f":"AP6+1","v":38},{"$f":"AQ6+1","v":39},{"$f":"AR6+1","v":40}]
[null,1,"state",{"$f":"IF(value!D7=\"\", \"\", value!D7)","v":2.9718027807762171E-3},{"$f":"_xll.AC.stats.markov.ctrl.getCalc(tree!I27, config!G57)","v":""},"","",1,1,1,1,1,1,1,1,1,1,1,1,1,1,1,1,1,0]
[null,{"$f":"B7+1","v":2},null,{"$f":"IF(value!D8=\"\", \"\", value!D8)","v":8.5094422246209736E-3},"","",1,1,1,1,1,1,1,1,1,1,1,1,1,1,1,1,1,1,0]
{"$rows_left_out":80}
{"sheet":"D","index":10,"n_rows":87,"n_cols":45,"rows_kept":87,"cut":false,"hidden":false,"merged":[[4,4,4,44],[6,2,86,2]]}
[]
[null,"State distribution"]
[null,null,null,null,{"$f":"SUM(E7:E500)","v":1},{"$f":"SUM(F7:F500)","v":1},0.99999999999999989,0.99999999999999989,1,1,0.99999999999999989,0.99999999999999989,0.99999999999999989,0.99999999999999978,1.0000000000000002,1,1,0.99999999999999989,1.0000000000000002,1,1.0000000000000002,1,0.99999999999999989,0.99999999999999978,0.99999999999999989,0,0,0,0,0,0,0,0,0,0,0,0,0,0,0,0,0,0,0,0]
[null,null,null,null,{"$f":"SUMPRODUCT($D$7:$D$101, E7:E101)","v":3.066E-2},{"$f":"SUMPRODUCT($D$7:$D$101, F7:F101)","v":3.0665961537250135E-2},3.067192307301728E-2,3.2959949212743943E-2,3.5247978474223354E-2,3.5697316305448895E-2,3.6146859799612921E-2,3.6596854452667478E-2,3.7047575612469776E-2,4.1707123868998379E-2,4.6366662404181441E-2,5.1026190845579057E-2,5.5685643342524384E-2,5.4617486180517774E-2,5.35494172485243E-2,5.2481552743882186E-2,5.1414078221232812E-2,5.4741211135537544E-2,5.8066624438049545E-2,6.1387930212987073E-2,6.4700512719910355E-2]
[null,null,null,null,"time period"]
[null,"#",null,null,0,{"$f":"E6+1","v":1},{"$f":"F6+1","v":2},{"$f":"G6+1","v":3},{"$f":"H6+1","v":4},{"$f":"I6+1","v":5},{"$f":"J6+1","v":6},7,8,9,10,11,12,13,14,15,16,17,18,19,20,21,22,23,24,25,26,27,28,29,30,31,32,{"$f":"AK6+1","v":33},{"$f":"AL6+1","v":34},{"$f":"AM6+1","v":35},{"$f":"AN6+1","v":36},{"$f":"AO6+1","v":37},{"$f":"AP6+1","v":38},{"$f":"AQ6+1","v":39},{"$f":"AR6+1","v":40}]
[null,1,"state",{"$f":"IF(value!D7=\"\", \"\", value!D7)","v":2.9718027807762171E-3},{"$f":"_xll.AC.stats.markov.getCalc(tree!I27, config!B57)","v":""},"","",8.6297939037363388E-6,3.421945244893134E-5,1.6336541473565191E-4,4.4959637053844002E-4,9.1282572478050853E-4,1.5364601269836006E-3,5.8500559330619344E-4,2.3104671882903985E-4,9.3513229022628509E-5,3.8517731373553202E-5,1.3829595908815197E-4,3.4672138760232668E-4,7.2740575512310953E-4,1.3583288458891346E-3,7.7128971467332419E-4,4.5350927736946707E-4,2.7267207634427011E-4,1.6647970305794438E-4]
[null,{"$f":"B7+1","v":2},null,{"$f":"IF(value!D8=\"\", \"\", value!D8)","v":8.5094422246209736E-3},"","",6.6990049778244685E-5,3.1832935703016016E-4,5.7734582074709393E-4,1.5140129916808534E-3,2.8157504231897828E-3,4.3239358218091755E-3,5.9075215762505739E-3,2.7610486570860491E-3,1.2278634209442467E-3,5.3715485635109743E-4,2.3387229112150192E-4,5.0458280143577013E-4,9.4143519998168346E-4,1.5843491827609291E-3,2.4652090910088982E-3,1.7997776561362159E-3,1.2107194075811399E-3,7.9147207583756603E-4,5.1177546723408368E-4]
{"$rows_left_out":80}
{"sheet":"validate","index":11,"n_rows":57,"n_cols":24,"rows_kept":57,"cut":false,"hidden":false,"merged":[]}
[]
[null,"TAB: MODEL VALIDATION"]
[]
[null,"Cash Flows Test",null,null,null,null,null,null,null,null,"Interest Rate Process Distribution Test",null,null,null,null,null,null,null,null,"Bond Bullet Price Test"]
[]
[null,{"$f":"cf!B10","v":"period-end"},null,{"$f":"cf!C10","v":20}," ",{"$f":"summary!B12","v":"dt"},null,{"$f":"cf!C14","v":0.25},null,null,null,null,null,null,null,null,null,null," "]
[null,{"$f":"_xll.AC.finance.srm.get(tree!I28, config!B25, F8)","v":"java.util.LinkedHashMap@Thu, 7 Feb 2019 12:29:32:323..53282219401931169"},null,null,null,{"$f":"config!B26","v":"sample-bond-index"},null,0,null,null,{"$f":"_xll.AC.finance.srm.validate.get(tree!I29, config!B38, )","v":"java.util.LinkedHashMap@Thu, 7 Feb 2019 12:29:30:628..4380787489695953979"},null,null,{"$f":"_xll.AC.data.size(K7, 1)","v":3}]
[null,{"$f":"_xll.AC.finance.cf.get(B7, \"\", )","v":"java.util.ArrayList@Thu, 7 Feb 2019 12:29:32:324..1254858725648167568"},null,null," ",{"$f":"_xll.AC.data.map(F7, H7)","v":"java.util.LinkedHashMap@Thu, 7 Feb 2019 12:29:32:208..4860711840628498781"},null,null," ",null,{"$f":"_xll.AC.data._get(K7, config!B39, )","v":"java.util.ArrayList@Thu, 7 Feb 2019 12:29:30:628..5900239313026907067"},null,{"$f":"_xll.AC.data.size(K8, 1)","v":4},{"$f":"_xll.AC.data.size(K8, 2)","v":22},{"$f":"_xll.AC.data._get(K7, config!B40, )","v":"java.util.ArrayList@Thu, 7 Feb 2019 12:29:30:628..204323430064850294"},null,{"$f":"_xll.AC.data.size(O8, 1)","v":4},{"$f":"_xll.AC.data.size(O8, 2)","v":22},null,{"$f":"_xll.AC.data._get(K7, config!B41, )","v":"java.util.ArrayList@Thu, 7 Feb 2019 12:29:30:628..6042628162586883839"},null,{"$f":"_xll.AC.data.size(T8, 1)","v":5},{"$f":"_xll.AC.data.size(T8, 2)","v":22}]
{"$rows_left_out":50}
{"sheet":"config","index":12,"n_rows":65,"n_cols":13,"rows_kept":65,"cut":false,"hidden":false,"merged":[]}
[]
[null,"TAB: CONFIGURATION FILE","Calculation enabled",null,true,null,"Test connection",null,{"$f":"_xll.AC.test.connection()","v":"host: CA2013466W3; user: Konstantin.Rybakov; key: null"}]
[]
[null,"Output keys",null,null,null,null,"Output array sizes"]
[]
[null,"Key","Description",null,null,null,"Array formula cell address","number of rows","number of cols","Description"]
[null,"Bond parameters",null,null,null,null,{"$f":"addressFla(params!C5)","v":"'params'!$C$5"},{"$f":"params!N47-1","v":277},1,"Sample volatility moving-average series"]
[null,"principal-amount","Bond principal amount",null,null,null,{"$f":"addressFla(params!H22)","v":"'params'!$H$22"},{"$f":"params!J19","v":13},{"$f":"params!L19","v":3},"Data = [period, drift, drift cumulative, yield]"]
{"$rows_left_out":58}
{"sheet":"guide","index":13,"n_rows":2,"n_cols":11,"rows_kept":2,"cut":false,"hidden":false,"merged":[[1,1,41,8],[1,10,41,18]]}
[]
[null,"Package: SRM\n\nInterest rate process modelling\n\nThe objective of the model is to analyze fixed income securities, specifically bonds. The template allows to set generic parameters for the interest rate tree but generally assumes specific inputs for the calculated bond prices and related interest rate options.\n\nModelling bond prices\n\nThe bond prices are modelled as follows:\n\n1. The bond terminal value. The terminal value is generally assumed to be equal to the sum of the outstanding principal value and the accrued interest. The outstanding principal value  depends on the (i) time period; (ii) applied amortization schedule; (iii) and exercised options. The accrued interest depends on the (i) time period; (ii) interest payment schedule; and (iii) outstanding balances used as a base for interest calculations.\n\n2. The bond coupon payments. The bond coupon payments depend on time period and interest payment terms. Fixed interest payments are assumed (will be extended to variable interest rate).\n\n3. Redemption price. The redemption price models the penalty that is applied in the case of bond option exercise. Generally, both call (early prepayment) and put (pay-on-demand) options nvolve a penalty that determines the bond redemption price.\n\n4. Amortization schedule. The schedule determines the timing of bond principal repayments. Based on the amortization schedule, the outstanding principal balances are calculated. \n\nNotes:\n\nA. Steady state. The mean reversion process is assumed to converge to current yield rate: ϑ = α x y0;\nB. Par value. If the bond at t=0 is priced at par, the initial value y0 must be calibrated to generate par value (y0 = coupon will not produce par value because the underlying yield rate process is modelled for zero-coupon bonds and has an increasing / decreasing term structure);",null,null,null,null,null,null,null,null,"Package: SRM\n\nShort cut key combinations: \nCtrl+Shft+C - calculate all; Ctrl+Shift+R - refresh addin; Ctrl+Shft+S - set the data ranges; \nCtrl+Shft+D - disable calculations; Ctrl+Shft+G - update graphs, Ctrl+Shft+H - highlight the graph used as a reference\n\nMarkov tree objects and output\n \nIMarkovTreeR1 tree = Markov.tree(int T, double x0, Map states, Object Q);\n\nConstruct Markov tree object using the following paarmeters:\nT          - number of periods\nx0        - initial state,\nstates - Map: X-min - minimum state value, X-max - maximum state value; X-count - number of states; and X-type which is set either to uniform or log-uniform to describe how the states are generated within the range;\nQ         - object that describes transition probabilities (typically in the form of a function: (t, x) => {xi => pi} that mapps given period and state (t, x) into a mapping {xi => pi} between next period states and probabilities;\n\nObject[][] out = Markov.get(IMarkovTreeR1 tree, String key, Map<String, Object> params);\n\nReturn the value of a given field (referred to bya given key) of the Markov tree using the given set of parameters (if necessary). Keys include:\nstate-values - an array[][] that describes tree structure (contains a state value in a given cell if the cell belong to the tree or zero otherwise);\nQ - returns an array of transition probabilities Q(xt, xt+1) for a given period t;\nP - return an array of tree state probabilites"]