{"text_format":"1","workbook":"xlsx","n_sheets":10,"sheets":["bond","inputs","tree","calc","yield","stats","cf","test","config","guide"],"not_rendered":{"charts":7,"images":0,"macros":1,"external_links":0,"defined_names":12,"comments":0,"pivot_tables":0},"unopened":[],"bounds":{"document_bytes":16777216,"sheet_cells":100000,"rows_first":2000,"rows_last":500,"rows_between":2000,"halvings":0,"cell_chars":16384,"cell_head_chars":4096},"cells_cut":0,"cells_raw":0,"read":"whole","date_system":"1900"}

{"sheet":"bond","index":0,"n_rows":42,"n_cols":5,"rows_kept":42,"cut":false,"hidden":false,"merged":[[3,1,3,4]]}
[]
[null,"TAB: BOND PARAMETERS"]
[]
[null,"Bond terms"]
[]
[null,"General parameters"]
[null,"Parameter","Value",null,"Description"]
[null,"T",10,null,"Term to maturity"]
[null,"dt",2,null,"Time increment"]
[null,"principal",100,null,"Bond principal amount"]
[null,"coupon-rate",0.05,null,"Coupon / dividend rate"]
[null,"coupon-frequency",1,null,"Coupon payment frequency (measured in the # of tree periods)"]
[null,"n",{"$f":"INT(C8/C9)+1","v":6},null,"Number of periods in the tree that measure the bond life"]
[]
[]
{"$rows_left_out":28}
{"sheet":"inputs","index":1,"n_rows":50,"n_cols":10,"rows_kept":50,"cut":false,"hidden":false,"merged":[[3,1,3,4],[3,6,3,9],[19,6,23,9],[17,6,17,9]]}
[]
[null,"TAB: INTEREST RATE TREE PARAMETERS"]
[]
[null,"Interest rate tree and tree calculator parameters",null,null,null,null,"Transition probability functions"]
[]
[null,"General parameters",null,null,null,null,"Function arguments"]
[null,"Parameter","Value",null,"Description",null,"Parameter","Value",null,"Description"]
[null,"Input parameters",null,null,null,null,"Diffusion drift and volatility function arguments"]
[null,"y0",{"$f":"bond!C11","v":0.05},null,"Initial yield rate",null,"t",0,null,"Time period"]
[null,"µ",0,null,"Drift parameter",null,"y",0,null,"Process state action"]
[null,"σ",1.0699999999999999E-2,null,"Standard deviation",null,"x",0,null,"Process state"]
[null,null,null,null,null,null,"mu",{"$f":"C10","v":0},null,"Diffusion drift parameter"]
[null,"Derived parameters",null,null,null,null,"sigma",{"$f":"C11","v":1.0699999999999999E-2},null,"Diffusion volatility parameter"]
[null,"(µ - σ2/2) x dt",{"$f":"(C10 - C11*C11/2)*bond!C9","v":-1.1448999999999998E-4},null,"Adjusted one-period drift parameter"]
[null,"σ x √dt",{"$f":"C11 * SQRT(bond!C9)","v":1.5132085117392117E-2},null,"Size of upward / downward movement"]
{"$rows_left_out":36}
{"sheet":"tree","index":2,"n_rows":59,"n_cols":26,"rows_kept":59,"cut":false,"hidden":false,"merged":[[28,5,38,5],[26,7,26,12],[25,15,25,16],[7,7,7,12],[7,17,7,22],[9,5,21,5],[9,15,21,15]]}
[]
[null,"TAB: INTEREST RATE TREE MODELING"]
[]
[null,"Controlled diffusion tree inputs and objects",null,null,"Controlled diffusion tree output"]
[]
[null,"Interest rate tree objects",null,null,"Tree states",null,null,null,null,null,null,null,null,null,"Tree state distribution"]
[]
[null,"Diffusion tree",null,null,null,null,null,"time period",null,null,null,null,null,null,null,null,null,"time period"]
[null,"Parameter","Value",null,"#",null,null,0,{"$f":"H9+1","v":1},{"$f":"I9+1","v":2},{"$f":"J9+1","v":3},4,5,null,"#",null,null,{"$f":"H9","v":0},1,2,3,4,5]
[null,"T",{"$f":"bond!C8","v":10}," ",1,"state",{"$f":"_xll.AC.stats.markov.getTree(B20, B29)","v":-9.4301338092045481E-2},{"$f":"_xll.AC.stats.markov.getTree(B20, B28)","v":""},"","","","",-9.4301338092045481E-2,null,{"$f":"E10","v":1},"state",{"$f":"IF(G10=\"\", \"\", G10)","v":-9.4301338092045481E-2},{"$f":"_xll.AC.stats.markov.getCalc(calc!B15, B31)","v":""},"","","","",5.3150416423259296E-5,null,null,"stats"]
[null,"dt",{"$f":"bond!C9","v":2}," ",{"$f":"E10+1","v":2},null,-6.567056266113637E-2,"","","","",-6.567056266113637E-2,-6.567056266113637E-2,null,2,null,-6.567056266113637E-2,"","","","",3.8054440161030661E-4,1.3712178438189527E-3]
[null,"y0",{"$f":"inputs!C9","v":0.05}," ",{"$f":"E11+1","v":3},null,-3.7039787230227265E-2,"","","",-3.7039787230227265E-2,-3.7039787230227265E-2,-3.7039787230227265E-2,null,3,null,-3.7039787230227265E-2,"","","",2.7246078458489447E-3,7.8540761705133237E-3,1.4416071133123771E-2]
[null,"states",{"$f":"inputs!C46","v":"java.util.LinkedHashMap@Sun, 24 Jun 2018 12:54:35:739..1430619658721585294"}," ",4,null,-8.4090117993181786E-3,"","",-8.4090117993181786E-3,-8.4090117993181786E-3,-8.4090117993181786E-3,-8.4090117993181786E-3,null,4,null,-8.4090117993181786E-3,"","",1.9507547298681795E-2,4.2174994820951717E-2,6.2309938736804717E-2,7.8497168490533398E-2]
[null,"process-params",null," ",5,null,2.0221763631590922E-2,"",2.0221763631590922E-2,2.0221763631590922E-2,2.0221763631590922E-2,2.0221763631590922E-2,2.0221763631590922E-2,null,5,null,2.0221763631590922E-2,"",0.13966942148760325,0.20130865378047938,0.22578681456636268,0.23266253504281009,0.23134554736608537]
[null,{"$f":"inputs!G27","v":"Fmu"},{"$f":"inputs!H27","v":"jkr.parser.lib.jmc.formula.objects.function.CodeFunctionX@Sun, 24 Jun 2018 12:54:38:707..8001981852497446155"}," ",6,null,4.8852539062500012E-2,4.8852539062500012E-2,4.8852539062500012E-2,4.8852539062500012E-2,4.8852539062500012E-2,4.8852539062500012E-2,4.8852539062500012E-2,null,6,null,4.8852539062500012E-2,1,0.7206611570247935,0.55836759784167866,0.45862716553367561,0.39358581129652664,0.34863368950003482]
{"$rows_left_out":45}
{"sheet":"calc","index":3,"n_rows":58,"n_cols":23,"rows_kept":58,"cut":false,"hidden":false,"merged":[[43,17,43,22],[45,15,57,15],[7,7,7,12],[43,7,43,12],[9,5,21,5],[45,5,57,5],[7,17,7,22],[9,15,21,15],[25,7,25,12],[25,17,25,22],[27,5,39,5],[27,15,39,15]]}
[]
[null,"TAB: INTEREST RATE TREE CALCULATOR OUTPUT"]
[]
[null,"Interest rate tree output"]
[]
[null,"Interest rate tree calculator objects",null,null,"Bond value in the presence of the option (full value including accrued interest)",null,null,null,null,null,null,null,null,null,"Option exercise action function"]
[]
[null,"Markov tree calculator",null,null,null,null,null,"time period",null,null,null,null,null,null,null,null,null,"time period"]
[null,"Parameter","Value"," ","#",null,null,0,{"$f":"H9+1","v":1},{"$f":"I9+1","v":2},{"$f":"J9+1","v":3},4,5,null,"#",null,null,0,{"$f":"R9+1","v":1},{"$f":"S9+1","v":2},{"$f":"T9+1","v":3},{"$f":"U9+1","v":4},{"$f":"V9+1","v":5}]
[null,"Interest rate tree model",{"$f":"tree!B20","v":"jeconkr.finance.HW.Derivatives2003.lib.ch23_srm.ShortRateModel@Sun, 24 Jun 2018 13:30:40:441..4490819340299241869"}," ",1,"state",{"$f":"IF(tree!G10=\"\", \"\", tree!G10)","v":-9.4301338092045481E-2},{"$f":"_xll.AC.finance.srm.get(B15, B28)","v":""},"","","","",-110,null,1,"state",{"$f":"IF(G10=\"\", \"\", G10)","v":-9.4301338092045481E-2},{"$f":"_xll.AC.stats.markovctrl.getCalc(B15, B32)","v":""},"","","","",0]
[null,"bond cash flows",{"$f":"cf!B20","v":"java.util.LinkedHashMap@Sun, 24 Jun 2018 13:22:19:205..2304287379002258535"}," ",{"$f":"E10+1","v":2},null,{"$f":"IF(tree!G11=\"\", \"\", tree!G11)","v":-6.567056266113637E-2},"","","","",-111,-110,null,{"$f":"O10+1","v":2},null,{"$f":"IF(G11=\"\", \"\", G11)","v":-6.567056266113637E-2},"","","","",1,0]
[null,"parameters",{"$f":"inputs!C47","v":"java.util.LinkedHashMap@Sun, 24 Jun 2018 12:54:35:752..6027289853123179485"}," ",{"$f":"E11+1","v":3},null,{"$f":"IF(tree!G12=\"\", \"\", tree!G12)","v":-3.7039787230227265E-2},"","","",-111,-111,-110,null,{"$f":"O11+1","v":3},null,-3.7039787230227265E-2,"","","",1,1,0]
[null,"executed methods",{"$f":"inputs!C48","v":"java.util.ArrayList@Sun, 24 Jun 2018 12:54:35:739..6401836390831474856"}," ",4,null,{"$f":"IF(tree!G13=\"\", \"\", tree!G13)","v":-8.4090117993181786E-3},"","",-112,-111,-111,-110,null,4,null,-8.4090117993181786E-3,"","",1,1,1,0]
[null,null,null," ",5,null,{"$f":"IF(tree!G14=\"\", \"\", tree!G14)","v":2.0221763631590922E-2},"",-113,-112,-111,-111,-110,null,5,null,2.0221763631590922E-2,"",1,1,1,1,0]
[null,{"$f":"_xll.AC.finance.srm.calc(\"SRM-calc\",  C10, C11, , C12, C13)","v":"jeconkr.finance.HW.Derivatives2003.lib.ch23_srm.calculator.CalculatorSRM@Sun, 24 Jun 2018 13:30:40:445..7132322343992425990"},null," ",6,null,{"$f":"IF(tree!G15=\"\", \"\", tree!G15)","v":4.8852539062500012E-2},-95.667310048810364,-106.73709423954847,-107.87516236670601,-108.99756605001099,-109.76079671603397,-110,null,6,null,4.8852539062500012E-2,0,0,0,0,0,0]
{"$rows_left_out":44}
{"sheet":"yield","index":4,"n_rows":38,"n_cols":23,"rows_kept":38,"cut":false,"hidden":false,"merged":[[7,5,19,5],[25,5,37,5],[7,15,19,15],[5,7,5,12],[5,17,5,22],[23,7,23,12]]}
[]
[null,"TAB: BOND YIELD RATES AND OPTION PREMIUM"]
[]
[null,"Parameters",null,null,"Bond value in the presence of the option",null,null,null,null,null,null,null,null,null,"Option annual premium"]
[]
[null,{"$f":"bond!B10","v":"principal"},{"$f":"bond!C10","v":100},null,null,null,null,"time period",null,null,null,null,null,null,null,null,null,"time period"]
[null,{"$f":"bond!B8","v":"T"},{"$f":"bond!C8","v":10},null,"#",null,null,0,{"$f":"H7+1","v":1},{"$f":"I7+1","v":2},{"$f":"J7+1","v":3},4,5,null,"#",null,null,0,{"$f":"R7+1","v":1},{"$f":"S7+1","v":2},{"$f":"T7+1","v":3},{"$f":"U7+1","v":4},{"$f":"V7+1","v":5}]
[null,{"$f":"bond!B11","v":"coupon-rate"},{"$f":"bond!C11","v":0.05},null,1,"state",{"$f":"calc!G10","v":-9.4301338092045481E-2},{"$f":"_xll.AC.finance.srm.get(calc!B15, calc!B30)","v":""},"","","","",null,null,1,"state",{"$f":"calc!Q10","v":-9.4301338092045481E-2},{"$f":"IF(H8=\"\", \"\", H8-H26)","v":""},{"$f":"IF(I8=\"\", \"\", I8-I26)","v":""},"","","",""]
[null,{"$f":"bond!B12","v":"coupon-frequency"},{"$f":"INT((1/bond!C9)/bond!C12)","v":0},null,{"$f":"E8+1","v":2},null,{"$f":"calc!G11","v":-6.567056266113637E-2},"","","","",4.4577636718750001E-2,null,null,{"$f":"O8+1","v":2},null,{"$f":"calc!Q11","v":-6.567056266113637E-2},{"$f":"IF(H9=\"\", \"\", H9-H27)","v":""},"","","",4.9526367187500003E-2,""]
[null,"dt",{"$f":"bond!C9","v":2},null,{"$f":"E9+1","v":3},null,{"$f":"calc!G12","v":-3.7039787230227265E-2},"","","",4.7141113281250001E-2,4.4577636718750001E-2,null,null,{"$f":"O9+1","v":3},null,{"$f":"calc!Q12","v":-3.7039787230227265E-2},{"$f":"IF(H10=\"\", \"\", H10-H28)","v":""},"","",5.2089843750000003E-2,4.9526367187500003E-2,""]
[null,null,null,null,4,null,{"$f":"calc!G13","v":-8.4090117993181786E-3},"","",4.601318359375E-2,4.7141113281250001E-2,4.4577636718750001E-2,null,null,4,null,{"$f":"calc!Q13","v":-8.4090117993181786E-3},{"$f":"IF(H11=\"\", \"\", H11-H29)","v":""},"",5.0961914062500002E-2,5.2089843750000003E-2,4.9526367187500003E-2,""]
[null,null,null,null,5,null,{"$f":"calc!G14","v":2.0221763631590922E-2},"",4.5397949218750004E-2,4.601318359375E-2,4.7141113281250001E-2,4.4577636718750001E-2,null,null,5,null,{"$f":"calc!Q14","v":2.0221763631590922E-2},{"$f":"IF(H12=\"\", \"\", H12-H30)","v":""},2.5532226562500003E-2,2.5737304687499997E-2,2.6660156249999997E-2,2.3891601562499996E-2,""]
[null,null,null,null,6,null,{"$f":"calc!G15","v":4.8852539062500012E-2},5.5856933593749998E-2,5.5241699218750002E-2,5.4318847656250002E-2,5.2883300781249996E-2,5.1345214843750001E-2,null,null,6,null,{"$f":"calc!Q15","v":4.8852539062500012E-2},{"$f":"IF(H13=\"\", \"\", H13-H31)","v":5.8447265624999994E-3},4.7167968750000053E-3,3.3837890625000033E-3,1.6406249999999928E-3,0,""]
[null,null,null,null,7,null,{"$f":"calc!G16","v":7.7483314493409117E-2},"",8.3439941406250009E-2,8.3542480468750013E-2,8.3645019531250003E-2,8.3850097656250011E-2,null,null,7,null,{"$f":"calc!Q16","v":7.7483314493409117E-2},{"$f":"IF(H14=\"\", \"\", H14-H32)","v":""},5.1269531249999167E-4,1.0253906250000389E-4,0,0,""]
[null,null,null,null,8,null,{"$f":"calc!G17","v":0.10611408992431819},"","",9.9948730468749997E-2,9.9948730468749997E-2,9.9948730468749997E-2,null,null,8,null,{"$f":"calc!Q17","v":0.10611408992431819},{"$f":"IF(H15=\"\", \"\", H15-H33)","v":""},"",0,0,0,""]
{"$rows_left_out":24}
{"sheet":"stats","index":5,"n_rows":57,"n_cols":13,"rows_kept":57,"cut":false,"hidden":false,"merged":[[44,5,56,5],[5,7,5,12],[5,4,6,4],[5,6,6,6],[24,7,24,12],[26,5,38,5],[42,7,42,12]]}
[]
[null,"TAB: INTEREST TREE STATISTICS"]
[]
[null,"Parameters",null,null,"Interest rate tree statistics"]
[]
[null,"Interest rate tree",{"$f":"calc!$B$15","v":"jeconkr.finance.HW.Derivatives2003.lib.ch23_srm.calculator.CalculatorSRM@Sun, 24 Jun 2018 13:30:40:445..7132322343992425990"}," ","Statistics",null,"Parameter","time period"]
[null,"Tree output parameters",null,null,null,null,null,0,{"$f":"H7+1","v":1},{"$f":"I7+1","v":2},3,4,{"$f":"L7+1","v":5}]
[null,"Field key",{"$f":"tree!B32","v":"path-stats"},null,"mean",null,null,{"$f":"_xll.AC.stats.diffusionctrl.getTree(C6, C8, C9)","v":0},0,0,0,0,0]
[null,"Parameters",{"$f":"tree!B46","v":"java.util.LinkedHashMap@Sun, 24 Jun 2018 12:54:35:750..3412010573071285858"}," ","stdev",null,null,0,0,0,0,0,0]
[null,null,null,null,"lower quartile",null,{"$f":"tree!C42","v":0.25},0,0,0,0,0,0]
[null,"Q output parameters",null,null,"upper quartile",null,{"$f":"tree!C43","v":0.75},0,0,0,0,0,0]
[null,"Q drift field parameter",{"$f":"tree!B33","v":"Q-drift"}]
[null,"Q sigma field parameter",{"$f":"tree!B34","v":"Q-sigma"}," "]
[]
[]
{"$rows_left_out":43}
{"sheet":"cf","index":6,"n_rows":35,"n_cols":13,"rows_kept":35,"cut":false,"hidden":false,"merged":[[3,1,3,4],[3,6,3,12]]}
[]
[null,"TAB: BOND INTEREST AND PRINCIPAL PAYMENTS CASH FLOWS"]
[]
[null,"Bond cash flows inputs",null,null,null,null,"Bond cash flows output"]
[]
[null,"Parameter","Value",null,"Description",null,"period","principal outstanding","principal paid","interest accrued","interest paid","Total amount paid","Redemption value"]
[null,"first period",0,null,null,null,0,{"$f":"_xll.AC.data._get(B20, \"\", 0)","v":100},0,0,0,0,100]
[null,"bond maturity period",{"$f":"C9","v":5},null,null," ",{"$f":"IF(G7=\"\", \"\", IF(G7+1>$C$9, \"\", G7+1))","v":1},100,0,10,10,10,113]
[null,"last period",{"$f":"bond!C13-1","v":5},null,{"$f":"bond!E10","v":"Bond principal amount"}," ",{"$f":"IF(G8=\"\", \"\", IF(G8+1>$C$9, \"\", G8+1))","v":2},100,0,10,10,10,112]
[null,{"$f":"bond!B10","v":"principal"},{"$f":"bond!C10","v":100},null,"Coupon rate"," ",3,100,0,10,10,10,111]
[null,{"$f":"bond!B11","v":"coupon-rate"},{"$f":"bond!C11","v":0.05},null,"Coupon payment frequency"," ",4,100,0,10,10,10,111]
[null,{"$f":"bond!B12","v":"coupon-frequency"},{"$f":"bond!C12","v":1},null,null," ",5,100,100,10,10,110,111]
[null,{"$f":"bond!B9","v":"dt"},{"$f":"bond!C9","v":2},null,null," ",""]
[null,{"$f":"bond!B18","v":"interest deferral period"},{"$f":"bond!C18","v":0},null,"Indicator of compounded interest"," ",""]
[null,{"$f":"bond!B19","v":"is compounded"},{"$f":"bond!C19","v":1}," ",{"$f":"bond!E28","v":"Bond amortization schedule"}," ",""]
{"$rows_left_out":21}
{"sheet":"test","index":7,"n_rows":58,"n_cols":25,"rows_kept":58,"cut":false,"hidden":false,"merged":[[45,11,57,11],[5,4,5,8],[5,1,5,2],[10,11,22,11],[28,11,40,11],[5,10,5,24]]}
[]
[null,"TAB: TESTING CODE EXECUTION"]
[]
[null,"Parameter testing"]
[]
[null,"Testing mapping and list input parameters",null,null,"Testing function input parameters",null,null,null,null,null,"Testing backward recursion"]
[]
[null,"State mapping",null,null,"Probability transition function Q(x)",null,null,null,null,null,"Tested bond value function",null,null,null,null,null,null,null,null,null,"Discount rates"]
[]
[null,"key","value",null,"#","t","y","x","FT(x)",null,"#",null,null,5,{"$f":"N10-1","v":4},{"$f":"O10-1","v":3},2,1,0,null,{"$f":"O10","v":4},{"$f":"P10","v":3},2,1,0]
[null,{"$f":"_xll.AC.data._get(inputs!C46, \"\", 1)","v":"java.lang.ClassCastException: java.lang.Double cannot be cast to java.util.Map"},"java.lang.ClassCastException: java.lang.Double cannot be cast to java.util.Map",null,1,0,0,-2,{"$f":"_xll.AC.math.F.eval(inputs!H27, F11:H17)","v":{"$error":"#NAME?"}},null,{"$f":"calc!E10","v":1},"state",{"$f":"IF(calc!G10=\"\", \"\", calc!G10)","v":-9.4301338092045481E-2},{"$f":"IF(calc!M10=\"\", \"\", calc!M10)","v":-110},{"$f":"IF(O29=\"\", \"\",  -O$25+U11*N11)","v":""},null,null,null,null,null,{"$f":"IF(calc!V46=\"\", \"\", calc!V46)","v":""}]
[null,"java.lang.ClassCastException: java.lang.Double cannot be cast to java.util.Map","java.lang.ClassCastException: java.lang.Double cannot be cast to java.util.Map",null,{"$f":"E11+1","v":2},1,0,{"$f":"H11+1","v":-1},{"$error":"#NAME?"},null,{"$f":"calc!E11","v":2},null,{"$f":"IF(calc!G11=\"\", \"\", calc!G11)","v":-6.567056266113637E-2},{"$f":"IF(calc!M11=\"\", \"\", calc!M11)","v":-110},{"$f":"IF(O30=\"\", \"\",  -O$25+U12*N12)","v":-135.43923914756692},null,null,null,null,null,{"$f":"IF(calc!V47=\"\", \"\", calc!V47)","v":1.1403567195233357}]
[null,"java.lang.ClassCastException: java.lang.Double cannot be cast to java.util.Map","java.lang.ClassCastException: java.lang.Double cannot be cast to java.util.Map",null,{"$f":"E12+1","v":3},1,0,0,{"$error":"#NAME?"},null,{"$f":"calc!E12","v":3},null,{"$f":"IF(calc!G12=\"\", \"\", calc!G12)","v":-3.7039787230227265E-2},{"$f":"IF(calc!M12=\"\", \"\", calc!M12)","v":-110},{"$f":"IF(O31=\"\", \"\",  -O$25+U13*N13)","v":-128.45817447487019},null,null,null,null,null,{"$f":"IF(calc!V48=\"\", \"\", calc!V48)","v":1.0768924952260928}]
[null,"java.lang.ClassCastException: java.lang.Double cannot be cast to java.util.Map","java.lang.ClassCastException: java.lang.Double cannot be cast to java.util.Map",null,4,0,0,1,{"$error":"#NAME?"},null,{"$f":"calc!E13","v":4},null,{"$f":"IF(calc!G13=\"\", \"\", calc!G13)","v":-8.4090117993181786E-3},{"$f":"IF(calc!M13=\"\", \"\", calc!M13)","v":-110},-121.86562669924304,null,null,null,null,null,{"$f":"IF(calc!V49=\"\", \"\", calc!V49)","v":1.0169602427203912}]
[null,"java.lang.ClassCastException: java.lang.Double cannot be cast to java.util.Map","java.lang.ClassCastException: java.lang.Double cannot be cast to java.util.Map",null,5,0,0,2,{"$error":"#NAME?"},null,{"$f":"calc!E14","v":5},null,{"$f":"IF(calc!G14=\"\", \"\", calc!G14)","v":2.0221763631590922E-2},{"$f":"IF(calc!M14=\"\", \"\", calc!M14)","v":-110},-115.63997370623927,null,null,null,null,null,{"$f":"IF(calc!V50=\"\", \"\", calc!V50)","v":0.96036339732944798}]
{"$rows_left_out":44}
{"sheet":"config","index":8,"n_rows":33,"n_cols":5,"rows_kept":33,"cut":false,"hidden":false,"merged":[]}
[]
[null,"TAB: CONFIGURATION FILE","Calculation enabled",null,true]
[]
[null,"Test connection",{"$f":"_xll.AC.test.connection()","v":"host: home-pc; user: Konstantin Rybakov; key: null"}]
[]
[null,"Output array sizes"]
[]
[null,"Maximum size"]
[]
[null,"Object","number of rows","number of cols"]
[null,"Tree dimension",13,6]
[null,"Transition probabilities",12,7]
[]
[null,{"$f":"bond!B8","v":"T"},{"$f":"bond!C8","v":10}]
[null,{"$f":"bond!B9","v":"dt"},{"$f":"bond!C9","v":2}]
{"$rows_left_out":19}
{"sheet":"guide","index":9,"n_rows":2,"n_cols":11,"rows_kept":2,"cut":false,"hidden":false,"merged":[[1,1,38,8],[1,10,38,18]]}
[]
[null,"Package: SRM\n\nInterest rate process modelling\n\nThe objective of the model is to analyze fixed income securities, specifically bonds. The template allows to set generic parameters for the interest rate tree but generally assumes specific inputs for the calculated bond prices and related interest rate options.\n\nModelling bond prices\n\nThe bond prices are modelled as follows:\n\n1. The bond terminal value. The terminal value is generally assumed to be equal to the sum of the outstanding principal value and the accrued interest. The outstanding principal value  depends on the (i) time period; (ii) applied amortization schedule; (iii) and exercised options. The accrued interest depends on the (i) time period; (ii) interest payment schedule; and (iii) outstanding balances used as a base for interest calculations.\n\n2. The bond coupon payments. The bond coupon payments depend on time period and interest payment terms. Fixed interest payments are assumed (will be extended to variable interest rate).\n\n3. Redemption price. The redemption price models the penalty that is applied in the case of bond option exercise. Generally, both call (early prepayment) and put (pay-on-demand) options nvolve a penalty that determines the bond redemption price.\n\n4. Amortization schedule. The schedule determines the timing of bond principal repayments. Based on the amortization schedule, the outstanding principal balances are calculated. ",null,null,null,null,null,null,null,null,"Package: SRM\n\nNote: to resize the output arrays, press Ctrl+R\n\nMarkov tree objects and output\n \nIMarkovTreeR1 tree = Markov.tree(int T, double x0, Map states, Object Q);\n\nConstruct Markov tree object using the following paarmeters:\nT          - number of periods\nx0        - initial state,\nstates - Map: X-min - minimum state value, X-max - maximum state value; X-count - number of states; and X-type which is set either to uniform or log-uniform to describe how the states are generated within the range;\nQ         - object that describes transition probabilities (typically in the form of a function: (t, x) => {xi => pi} that mapps given period and state (t, x) into a mapping {xi => pi} between next period states and probabilities;\n\nObject[][] out = Markov.get(IMarkovTreeR1 tree, String key, Map<String, Object> params);\n\nReturn the value of a given field (referred to bya given key) of the Markov tree using the given set of parameters (if necessary). Keys include:\nstate-values - an array[][] that describes tree structure (contains a state value in a given cell if the cell belong to the tree or zero otherwise);\nQ - returns an array of transition probabilities Q(xt, xt+1) for a given period t;\nP - return an array of tree state probabilites"]