{"text_format":"1","workbook":"xlsx","n_sheets":8,"sheets":["data","calc","TS","charts","fitted","res","config","guide"],"not_rendered":{"charts":7,"images":0,"macros":1,"external_links":0,"defined_names":10,"comments":0,"pivot_tables":0},"unopened":[],"bounds":{"document_bytes":16777216,"sheet_cells":100000,"rows_first":2000,"rows_last":500,"rows_between":2000,"halvings":0,"cell_chars":16384,"cell_head_chars":4096},"cells_cut":0,"cells_raw":0,"read":"whole","date_system":"1900"}

{"sheet":"data","index":0,"n_rows":482,"n_cols":31,"rows_kept":482,"cut":false,"hidden":false,"merged":[]}
[]
[null,null,"TAB: YIELD DATA (IN %)"]
[null,null,null,null,null,null,null,null,null,null,null,null,null,null,null,"Utilities industry, sample of B rated bonds",null,null,null,null,null,null,null,null,null,null,"Utilities industry, sample of B- rated bonds"]
[null,null,"Treasury yield rates",null,null,null,null,null,null,null,null,null,null,null,null,1,2,3,4,5,6,8,9,10,11,null,14,15,16,17,18]
[null,"#","Date","C0823M","C0826M","C0821Y","C0822Y","C0823Y","C0825Y","C0827Y","C08210Y","C08220Y","C08230Y",null,null,"EK697585","UV308871","EK697591","UV309161","EK376512","EK129557","EK726871","UV309350","EK376500","QZ797088",null,"EH258733","EK355400","EI702963","EK408885","LW316363"]
[null,null,null,{"$f":"3/12","v":0.25},{"$f":"6/12","v":0.5},1,2,3,5,7,10,20,30,null,"Date",1.8879999999999999,2.1859999999999999,4.1449999999999996,5.1920000000000002,5.3970000000000002,5.7729999999999997,6.444,7.1950000000000003,7.4,7.4,null,0.68200000000000005,1.8879999999999999,3.6850000000000001,4.3970000000000002,5.8109999999999999]
[null,1,"2015-09-30",0.14829999999999999,0.22159999999999999,0.3427,0.66600000000000004,0.95609999999999995,1.4188000000000001,1.7693000000000001,2.1002999999999998,2.6234000000000002,2.9022000000000001,null,"2017-08-29",5.9059999999999997,4.93,7.5490000000000004,6.6130000000000004,6.3680000000000003,6.1539999999999999,6.7489999999999997,7.0629999999999997,7.1050000000000004,7.5270000000000001,null,3.988,5.3470000000000004,7.8940000000000001,7.6349999999999998,7.9729999999999999]
[null,{"$f":"B7+1","v":2},"2015-06-30",0.12620000000000001,0.1729,0.2767,0.69140000000000001,1.0805,1.6668000000000001,2.0746000000000002,2.4155000000000002,2.9403000000000001,3.1377999999999999,null,"2017-08-28",5.9349999999999996,4.92,7.4850000000000003,6.5679999999999996,6.3079999999999998,6.1520000000000001,6.8109999999999999,7.0650000000000004,7.048,7.51,null,3.98,5.4660000000000002,7.7359999999999998,8.1280000000000001,7.9429999999999996]
[null,{"$f":"B8+1","v":3},"2015-03-31",0.12039999999999999,0.15890000000000001,0.24660000000000001,0.60660000000000003,0.93889999999999996,1.4016999999999999,1.7037,1.9812000000000001,2.3881000000000001,2.5604,null,"2017-08-25",5.6970000000000001,4.9269999999999996,7.3920000000000003,6.5979999999999999,6.2629999999999999,6.1349999999999998,6.7919999999999998,7.0640000000000001,7.0439999999999996,7.4829999999999997,null,3.9710000000000001,5.2629999999999999,7.6109999999999998,8.0960000000000001,7.9429999999999996]
[null,4,"2014-12-31",0.1113,0.15190000000000001,0.25140000000000001,0.72340000000000004,1.1506000000000001,1.6680999999999999,1.9653,2.2164000000000001,2.5394000000000001,2.786,null,"2017-08-24",5.7789999999999999,4.9210000000000003,7.3739999999999997,6.5949999999999998,6.4470000000000001,6.2610000000000001,6.952,7.117,7.08,7.4610000000000003,null,4.1150000000000002,5.492,7.851,8.0559999999999992,7.9429999999999996]
{"$rows_left_out":473}
{"sheet":"calc","index":1,"n_rows":215,"n_cols":20,"rows_kept":215,"cut":false,"hidden":false,"merged":[]}
[]
[null,"TAB: NELSON-SIEGEL TERM STRUCTURE CALCULATOR"]
[null,null,null,null,null,null,null,null,null,null,null,null,null,null,null,"Total number of observations",null,null,null,{"$f":"COUNT(data!O7:O1001)","v":476}]
[null,"A. Yield Sample"]
[null,"Maturity",{"$f":"data!P6","v":1.8879999999999999},{"$f":"data!Q6","v":2.1859999999999999},{"$f":"data!R6","v":4.1449999999999996},{"$f":"data!S6","v":5.1920000000000002},{"$f":"data!T6","v":5.3970000000000002},{"$f":"data!U6","v":5.7729999999999997},{"$f":"data!V6","v":6.444},{"$f":"data!W6","v":7.1950000000000003},{"$f":"data!X6","v":7.4},null,null,null,null,"Date",null,"Row index"]
[null,"Yields actual (end)",{"$f":"OFFSET(data!P6, $R$6, 0)","v":5.9059999999999997},{"$f":"OFFSET(data!Q6, $R$6, 0)","v":4.93},{"$f":"OFFSET(data!R6, $R$6, 0)","v":7.5490000000000004},{"$f":"OFFSET(data!S6, $R$6, 0)","v":6.6130000000000004},{"$f":"OFFSET(data!T6, $R$6, 0)","v":6.3680000000000003},{"$f":"OFFSET(data!U6, $R$6, 0)","v":6.1539999999999999},{"$f":"OFFSET(data!V6, $R$6, 0)","v":6.7489999999999997},{"$f":"OFFSET(data!W6, $R$6, 0)","v":7.0629999999999997},{"$f":"OFFSET(data!X6, $R$6, 0)","v":7.1050000000000004},null,null,null,null,"End date",{"$f":"data!O7","v":"2017-08-29"},{"$f":"MATCH(Q6, data!$O$7:$O$501, 0)","v":1},"width",{"$f":"COUNT(C5:N5)","v":9}]
[null,"Yields actual (start)",{"$f":"OFFSET(data!P6, $R$7, 0)","v":7.0730000000000004},{"$f":"OFFSET(data!Q6, $R$7, 0)","v":5.6859999999999999},{"$f":"OFFSET(data!R6, $R$7, 0)","v":7.9989999999999997},{"$f":"OFFSET(data!S6, $R$7, 0)","v":7.3869999999999996},{"$f":"OFFSET(data!T6, $R$7, 0)","v":5.1989999999999998},{"$f":"OFFSET(data!U6, $R$7, 0)","v":7.524},{"$f":"OFFSET(data!V6, $R$7, 0)","v":5.4980000000000002},{"$f":"OFFSET(data!W6, $R$7, 0)","v":7.74},{"$f":"OFFSET(data!X6, $R$7, 0)","v":5.8470000000000004},null,null,null,null,"Start date",{"$f":"OFFSET(data!O6, MIN(T3, R7), 0)","v":"2016-10-07"},200,"height",{"$f":"R7-R6+1","v":200}]
[]
[null,"B. Calculator:",{"$f":"_xll.AC.data.map(P10, Q10)","v":"java.util.LinkedHashMap@Sun, 24 Jun 2018 13:35:01:417..2124750325735269764"},null,null,null,null,null,null,null,"  ","Available methods",null,"α",null,"Selected parameters",null,"Parameter description"]
[null,null,{"$f":"_xll.AC.finance.irb.ts.calcTSN(\"NS\", OFFSET(C5, 0, 0, 1, T6), OFFSET(data!$P$6, R6, 0, T7, T6), C9)","v":"jeconkr.finance.FSTP.lib.model.yts.calculator.CalculatorNelsonSiegelN@Sun, 24 Jun 2018 21:46:26:450..7813956265929901171"},null,null,null,null,null,null,null,"  ",{"$f":"config!B9","v":"Diebold-Li"},null,{"$f":"1/1.37","v":0.72992700729927007},null,"method",{"$f":"L10","v":"Diebold-Li"},"Term structure estimation method"]
{"$rows_left_out":206}
{"sheet":"TS","index":2,"n_rows":314,"n_cols":12,"rows_kept":314,"cut":false,"hidden":false,"merged":[]}
[]
[null,"TAB: COEFFICIENTS"]
[]
[null,"Date","α","β0","β1","β2","β0 + β1 ",null,"α",null,null,"β0 (long-term rate)"]
[null,{"$f":"data!O7","v":"2017-08-29"},{"$f":"_xll.AC.finance.irb.ts._get(calc!C10, config!D9, 0)","v":0.72992700729927007},16.128755233257834,28.534437583526596,-77.833498547784984,{"$f":"IF(B5=\"\", \"\", D5+E5)","v":44.663192816784431}]
[null,{"$f":"data!O8","v":"2017-08-28"},0.72992700729927007,16.064652819673938,27.572592304437421,-76.507768678944558,{"$f":"IF(B6=\"\", \"\", D6+E6)","v":43.637245124111359}]
[null,{"$f":"data!O9","v":"2017-08-25"},0.72992700729927007,15.948599216746516,26.136010415269993,-74.421388594433665,42.084609632016509]
[null,{"$f":"data!O10","v":"2017-08-24"},0.72992700729927007,15.973848887559143,26.4296842191834,-74.859051472973078,42.403533106742543]
[null,{"$f":"data!O11","v":"2017-08-23"},0.72992700729927007,16.090454867451626,28.00297144590877,-77.089025367400609,44.093426313360396]
[null,{"$f":"data!O12","v":"2017-08-22"},0.72992700729927007,16.18488292076654,29.180072757299058,-78.788450120016932,45.364955678065598]
{"$rows_left_out":305}
{"sheet":"charts","index":3,"n_rows":2,"n_cols":2,"rows_kept":2,"cut":false,"hidden":false,"merged":[]}
[]
[null,"TAB: CHARTS"]

{"sheet":"fitted","index":4,"n_rows":205,"n_cols":26,"rows_kept":205,"cut":false,"hidden":false,"merged":[]}
[]
[null,null,"TAB: FITTED YIELD TERM STRUCTURE",null,null,null,null,null,null,null,null,"Mean (in bps)",null,null,{"$f":"100*AVERAGE(O6:O1000)","v":-1.0597449412885318},{"$f":"100*AVERAGE(P6:P1000)","v":1.3779819619748519},-0.85347163058179765,-2.0702259263093388,2.1418523851600568,-2.8044571025169782,0.4097746367753673,3.6908773345729062,-0.83258671777994664]
[null,null,null,null,null,null,null,null,null,null,null,"StDev (in bps)",null,null,{"$f":"100*STDEV(O6:O1000)","v":1.7219311260311929},{"$f":"100*STDEV(P6:P1000)","v":2.0801969688649726},1.1288601173244146,1.362397469942688,1.2548995456653975,2.1874940523377777,1.1361417473113509,2.6020076324112034,1.0662830482182573]
[null,null,"Fitted yields (in %)",null,null,null,null,null,null,null,null,null,null,null,"Term structure residuals (in %)",null,null,null,null,null,null,null,null,null,null,"Test"]
[null,"#",{"$f":"TS!B4","v":"Date"},{"$f":"calc!C5","v":1.8879999999999999},{"$f":"calc!D5","v":2.1859999999999999},{"$f":"calc!E5","v":4.1449999999999996},{"$f":"calc!F5","v":5.1920000000000002},{"$f":"calc!G5","v":5.3970000000000002},{"$f":"calc!H5","v":5.7729999999999997},{"$f":"calc!I5","v":6.444},{"$f":"calc!J5","v":7.1950000000000003},{"$f":"calc!K5","v":7.4},{"$f":"calc!L5","v":0},null,{"$f":"D5","v":1.8879999999999999},2.1859999999999999,4.1449999999999996,5.1920000000000002,5.3970000000000002,5.7729999999999997,6.444,7.1950000000000003,7.4,null,null,"SUM"]
[null,1,{"$f":"IF(TS!B5=\"\", \"\", TS!B5)","v":"2017-08-29"},{"$f":"_xll.AC.finance.irb.ts._get(calc!C10, config!D10, 0)","v":5.8910416511704184},4.9336987644514529,7.5329584996304515,6.620876356361924,6.3698132999467116,6.1483519459552838,6.7585389342581461,7.0703644125342127,7.1113561354961448,null,null,{"$f":"IF($C6=\"\", \"\", data!P7-D6)","v":1.4958348829581247E-2},{"$f":"IF($C6=\"\", \"\", data!Q7-E6)","v":-3.6987644514532292E-3},{"$f":"IF($C6=\"\", \"\", data!R7-F6)","v":1.6041500369548878E-2},{"$f":"IF($C6=\"\", \"\", data!S7-G6)","v":-7.87635636192352E-3},{"$f":"IF($C6=\"\", \"\", data!T7-H6)","v":-1.8132999467113109E-3},{"$f":"IF($C6=\"\", \"\", data!U7-I6)","v":5.6480540447161331E-3},{"$f":"IF($C6=\"\", \"\", data!V7-J6)","v":-9.5389342581464476E-3},{"$f":"IF($C6=\"\", \"\", data!W7-K6)","v":-7.3644125342129385E-3},{"$f":"IF($C6=\"\", \"\", data!X7-L6)","v":-6.3561354961443328E-3},null,null,{"$f":"SUM(O6:X6)","v":1.9525447925161643E-10}]
[null,{"$f":"B6+1","v":2},{"$f":"IF(TS!B6=\"\", \"\", TS!B6)","v":"2017-08-28"},5.9224628623357027,4.9228581962018687,7.470170392018499,6.575228917325564,6.3087361633252144,6.1474319292965021,6.8202050626356741,7.0707385500857072,7.0541679268249418,null,null,{"$f":"IF($C7=\"\", \"\", data!P8-D7)","v":1.2537137664296871E-2},{"$f":"IF($C7=\"\", \"\", data!Q8-E7)","v":-2.858196201868779E-3},{"$f":"IF($C7=\"\", \"\", data!R8-F7)","v":1.4829607981501347E-2},{"$f":"IF($C7=\"\", \"\", data!S8-G7)","v":-7.2289173255644101E-3},{"$f":"IF($C7=\"\", \"\", data!T8-H7)","v":-7.3616332521453387E-4},{"$f":"IF($C7=\"\", \"\", data!U8-I7)","v":4.5680707034980728E-3},{"$f":"IF($C7=\"\", \"\", data!V8-J7)","v":-9.2050626356741105E-3},{"$f":"IF($C7=\"\", \"\", data!W8-K7)","v":-5.7385500857067839E-3},{"$f":"IF($C7=\"\", \"\", data!X8-L7)","v":-6.1679268249417163E-3},null,null,{"$f":"SUM(O7:X7)","v":-4.9674042656988604E-11}]
[null,{"$f":"B7+1","v":3},{"$f":"IF(TS!B7=\"\", \"\", TS!B7)","v":"2017-08-25"},5.6819768560298307,4.9314827229368916,7.3778064342288818,6.6065958986202791,6.2653218388925964,6.1335311742293754,6.8006521332942516,7.0669823493407868,7.0476505922720971,null,null,{"$f":"IF($C8=\"\", \"\", data!P9-D8)","v":1.502314397016935E-2},{"$f":"IF($C8=\"\", \"\", data!Q9-E8)","v":-4.482722936892003E-3},{"$f":"IF($C8=\"\", \"\", data!R9-F8)","v":1.4193565771118521E-2},{"$f":"IF($C8=\"\", \"\", data!S9-G8)","v":-8.5958986202792076E-3},{"$f":"IF($C8=\"\", \"\", data!T9-H8)","v":-2.3218388925965172E-3},{"$f":"IF($C8=\"\", \"\", data!U9-I8)","v":1.468825770624349E-3},{"$f":"IF($C8=\"\", \"\", data!V9-J8)","v":-8.6521332942517404E-3},{"$f":"IF($C8=\"\", \"\", data!W9-K8)","v":-2.9823493407867829E-3},{"$f":"IF($C8=\"\", \"\", data!X9-L8)","v":-3.6505922720975192E-3},null,null,1.5500845051974466E-10]
[null,4,{"$f":"IF(TS!B8=\"\", \"\", TS!B8)","v":"2017-08-24"},5.7642351940104959,4.9244598755877149,7.3616970034715017,6.6027048669613251,6.4524715495346143,6.2618688425265745,6.957985127526829,7.1181206331601157,7.0824569078654758,null,null,{"$f":"IF($C9=\"\", \"\", data!P10-D9)","v":1.4764805989504026E-2},{"$f":"IF($C9=\"\", \"\", data!Q10-E9)","v":-3.4598755877146559E-3},{"$f":"IF($C9=\"\", \"\", data!R10-F9)","v":1.2302996528497978E-2},{"$f":"IF($C9=\"\", \"\", data!S10-G9)","v":-7.7048669613253296E-3},{"$f":"IF($C9=\"\", \"\", data!T10-H9)","v":-5.4715495346142617E-3},{"$f":"IF($C9=\"\", \"\", data!U10-I9)","v":-8.68842526574376E-4},{"$f":"IF($C9=\"\", \"\", data!V10-J9)","v":-5.9851275268290038E-3},{"$f":"IF($C9=\"\", \"\", data!W10-K9)","v":-1.1206331601156805E-3},{"$f":"IF($C9=\"\", \"\", data!X10-L9)","v":-2.4569078654756993E-3},null,null,-6.4464700244570849E-10]
[null,5,{"$f":"IF(TS!B9=\"\", \"\", TS!B9)","v":"2017-08-23"},5.8676920961304795,4.9282093292876468,7.4709377239492181,6.5970185799169592,6.5031919402775653,6.2800348518296705,6.9609241249887948,7.1155600839814372,7.1784312698228092,null,null,{"$f":"IF($C10=\"\", \"\", data!P11-D10)","v":1.5307903869520523E-2},{"$f":"IF($C10=\"\", \"\", data!Q11-E10)","v":-3.2093292876469448E-3},{"$f":"IF($C10=\"\", \"\", data!R11-F10)","v":1.4062276050782252E-2},{"$f":"IF($C10=\"\", \"\", data!S11-G10)","v":-7.018579916959311E-3},{"$f":"IF($C10=\"\", \"\", data!T11-H10)","v":-5.191940277565088E-3},{"$f":"IF($C10=\"\", \"\", data!U11-I10)","v":9.6514817032922195E-4},{"$f":"IF($C10=\"\", \"\", data!V11-J10)","v":-7.9241249887944676E-3},{"$f":"IF($C10=\"\", \"\", data!W11-K10)","v":-4.5600839814374794E-3},{"$f":"IF($C10=\"\", \"\", data!X11-L10)","v":-2.4312698228090568E-3},null,null,-1.8458035100366033E-10]
{"$rows_left_out":196}
{"sheet":"res","index":5,"n_rows":19,"n_cols":13,"rows_kept":19,"cut":false,"hidden":false,"merged":[]}
[]
[null,"TAB: COVARIANCE MATRIX OF TERM-STRUCTURE RESIDUALS"]
[]
[]
[null,null,"#",1,{"$f":"D5+1","v":2},{"$f":"E5+1","v":3},4,5,6,7,8,9,{"$f":"L5+1","v":10}]
[null,null,"maturity",{"$f":"D9","v":1.8879999999999999},{"$f":"E9","v":2.1859999999999999},4.1449999999999996,5.1920000000000002,5.3970000000000002,5.7729999999999997,6.444,7.1950000000000003,7.4,0]
[null,null,"stdev",{"$f":"SQRT(OFFSET($C$9, D5, D5))","v":3.3341222772426544},{"$f":"SQRT(OFFSET($C$9, E5, E5))","v":2.324370158507818},0.57297503750573442,0.55681404673715451,0.33356888322600997,0.69168129837475756,0.3798788094171654,0.58957802640059664,0.39702205607348473,0]
[]
[null,"#","maturity",{"$f":"calc!C5","v":1.8879999999999999},{"$f":"calc!D5","v":2.1859999999999999},{"$f":"calc!E5","v":4.1449999999999996},{"$f":"calc!F5","v":5.1920000000000002},{"$f":"calc!G5","v":5.3970000000000002},{"$f":"calc!H5","v":5.7729999999999997},{"$f":"calc!I5","v":6.444},{"$f":"calc!J5","v":7.1950000000000003},{"$f":"calc!K5","v":7.4},{"$f":"calc!L5","v":0}]
[null,1,{"$f":"OFFSET($C$9, 0, B10)","v":1.8879999999999999},{"$f":"_xll.AC.finance.irb.ts._get(calc!C10, config!D12, 1)","v":11.116371359605743},7.495085643045492,1.1982064258186487,-1.2186866971177253,-0.17597869036124392,-1.6925970645157147,-9.2766414290486932E-2,-1.4252579186508232,3.8454443096396673E-2]
{"$rows_left_out":10}
{"sheet":"config","index":6,"n_rows":19,"n_cols":8,"rows_kept":19,"cut":false,"hidden":false,"merged":[]}
[]
[null,"TAB: CONFIGURATION FILE",null,null,"Calculation enabled",null,true]
[]
[]
[null,"Test connection",{"$f":"_xll.AC.test.connection()","v":"host: home-pc; user: Konstantin Rybakov; key: null"}]
[]
[]
[null,"Term structure estimation methods",null,"Term structure output keys",null,null,"Alpha (α) range"]
[null,"Diebold-Li",null,"TS-coeffs","Array of term structure regression coefficients",null,"minimum",0.1]
[null,"Fabozzi",null,"TS-yields-fitted","Fitted term structure yields",null,"maximum",1]
{"$rows_left_out":10}
{"sheet":"guide","index":7,"n_rows":2,"n_cols":2,"rows_kept":2,"cut":false,"hidden":false,"merged":[[1,1,32,8]]}
[]
[null,"Package: IRB.TS\n\nAvailable functions for term structure estimation:\n\nCalculatorNelsonSiegel calc = calcTS(Map<Double, Double> sample, String method)\nwhere sample is the mapping t => y[t] of maturity term into related yield rate and method parameter is the method used to estimate the term structure. The list of methods includes:\n     Diebold-Li\n     Fabozzi \n     Nelson-Siegel\n     Ridge-OLS\n\ndouble[][] (double[]) CalculatorNelsonSiegel calc, String key)\nwhere key represents the key for a specific retrieved field. The following keys can be used:\n1. TS-coeffs: coefficients of the term structure (as a list (α, β0, β1, β2);\n2. TS-yields-fitted: fitted term structure values;\n3. TS-R2: the values R2(α) for a grid of α values;"]