{"text_format":"1","workbook":"xlsx","n_sheets":6,"sheets":["calc","TS","sample","curv","config","guide"],"not_rendered":{"charts":8,"images":0,"macros":1,"external_links":0,"defined_names":9,"comments":0,"pivot_tables":0},"unopened":[],"bounds":{"document_bytes":16777216,"sheet_cells":100000,"rows_first":2000,"rows_last":500,"rows_between":2000,"halvings":0,"cell_chars":16384,"cell_head_chars":4096},"cells_cut":0,"cells_raw":0,"read":"whole","date_system":"1900"}

{"sheet":"calc","index":0,"n_rows":50,"n_cols":37,"rows_kept":50,"cut":false,"hidden":false,"merged":[]}
[]
[null,"TAB: NELSON-SIEGEL TERM STRUCTURE",null,null,null,null,null,null,null,null,null,null,null,null,null,null,null,null,null,null,null,null,null,null,null,null,null,null,null,null,"yields eliminated"]
[null,null,null,null,null,null,null,null,null,null,null,null,null,null,null,null,null,null,null,null,null,null,null,null,null,null,null,null,null,null,"yields fitted"]
[null,"Yield Sample",null,null,null,null,null,null,"Output",null,null,null,null,null,null,null,"Calculator:",null,null,null,null,null,null,null,null,null,"Yields and fitted yields",null,null,null,"yields actual",null,null,null,null,null,"R2(α)"]
[null,null,null,null,null,null,null,null,"α","β0","β1","β2",null,null,null,null,"Parameter","Object"]
[null,"Sample count",null,null,null,null,null,null,{"$f":"_xll.AC.finance.irb.yts._get(R9, config!D6, 1)","v":0.33333333333333331},1.0198645001986149,2.1994636671991916,4.2166096237984663,null,null,null,null,"tenors:",{"$f":"_xll.AC.data.list_x(OFFSET(C12, 0, 0, D7, 1), 1, 1)","v":"java.util.ArrayList@Wed, 26 Sep 2018 15:07:26:758..1137113503805849784"},null,null,null,null,null,null," "]
[null,"Original",null,{"$f":"COUNTA(sample!C6:C101)","v":8},null,null,null,null,null,null,null,null,null,null,null,null,"yields:",{"$f":"_xll.AC.data.list_x(OFFSET(D12, 0, 0, D7, 1), 1, 1)","v":"java.util.ArrayList@Wed, 26 Sep 2018 15:07:26:758..2239115289336395169"},null,null,null,null,null,null," "]
[null,"Final",null,{"$f":"D7-Y13","v":8},null,null,null,null,null,null,"RMSE",{"$f":"SQRT(SUMPRODUCT(L12:L50, L12:L50) / D8)","v":4.7302587220245294E-2},null,null,null,null,"parameters:",{"$f":"_xll.AC.data.map(U12:U16, Y12:Y16)","v":"java.util.LinkedHashMap@Wed, 26 Sep 2018 15:07:26:757..1132630691865613397"},null,null,null,null,null,null," "]
[null,null,null,null,null,null,null,null,null,null,null,null,null,null,null,null,"calculator:",{"$f":"_xll.AC.finance.irb.yts.calcTS(\"NS\", R6, R7, R8)","v":"jeconkr.finance.FSTP.lib.model.yts.calculator.CalculatorNelsonSiegelS@Wed, 26 Sep 2018 15:16:26:700..8870130776766751500"},null,null,null,null,null,null," "]
[null,"Original sample",null,null,null,null,null,null,"Final sample",null,null,null,null,"R2(α)"]
[null,"#","tenor","yield actual","index in final sample","yield actual matched","yield fitted matched",null,"tenor","yield actual","yield fitted","res",null,"α","R2",null,"Available methods",null,"α",null,"Parameter",null,null,null,"Value","Test"]
[null,1,{"$f":"IF(B12=\"\", \"\", OFFSET(sample!$E$5, B12, 0))","v":1.5660506502395619},{"$f":"IF(B12=\"\", \"\", OFFSET(sample!$F$5, B12, 0))","v":3.5209999999999999},{"$f":"IF(B12=\"\", \"\", IF(ISERROR(MATCH(B12, $Y$21:$Y$50, 0)), \"\", MATCH(B12, $Y$21:$Y$50, 0)))","v":1},{"$f":"IF(B12=\"\", \"\", IF(E12=\"\",  \"\", D12))","v":3.5209999999999999},{"$f":"IF(B12=\"\", \"\", TS!L28)","v":3.5164971357823549},null,{"$f":"_xll.AC.finance.irb.yts._get(R9, config!D7, 1)","v":1.5660506502395619},3.5209999999999999,3.5164971357823549,4.5028642176450084E-3,null,{"$f":"_xll.AC.finance.irb.yts._get(R9, config!D10, 0)","v":0.33333333333333331},0.87379665462804135,null,{"$f":"config!B6","v":"Diebold-Li"},null,{"$f":"1/1.37","v":0.72992700729927007},null,"method",null,null,null,{"$f":"Q13","v":"Fabozzi"}]
[null,{"$f":"IF(OR(B12=$D$7, B12=\"\"), \"\", B12+1)","v":2},{"$f":"IF(B13=\"\", \"\", OFFSET(sample!$E$5, B13, 0))","v":0.17248459958932238},{"$f":"IF(B13=\"\", \"\", OFFSET(sample!$F$5, B13, 0))","v":3.2549999999999999},{"$f":"IF(B13=\"\", \"\", IF(ISERROR(MATCH(B13, $Y$21:$Y$50, 0)), \"\", MATCH(B13, $Y$21:$Y$50, 0)))","v":2},{"$f":"IF(B13=\"\", \"\", IF(E13=\"\",  \"\", D13))","v":3.2549999999999999},{"$f":"IF(B13=\"\", \"\", TS!L29)","v":3.2739629286574945},null,0.17248459958932238,3.2549999999999999,3.2739629286574945,-1.8962928657494604E-2,null,0.33333333333333331,0.87379665462804135,null,{"$f":"config!B7","v":"Fabozzi"},null,{"$f":"1/3","v":0.33333333333333331},null,"screen-count",null,null,null,0]
[null,{"$f":"IF(OR(B13=$D$7, B13=\"\"), \"\", B13+1)","v":3},{"$f":"IF(B14=\"\", \"\", OFFSET(sample!$E$5, B14, 0))","v":2.4038329911019849},{"$f":"IF(B14=\"\", \"\", OFFSET(sample!$F$5, B14, 0))","v":3.548},3,3.548,{"$f":"IF(B14=\"\", \"\", TS!L30)","v":3.5416228366914355},null,2.4038329911019849,3.548,3.5416228366914355,6.3771633085645263E-3,null,0.33333333333333331,0.87379665462804135,null,{"$f":"config!B8","v":"Nelson-Siegel"},null,"[0, 1]",null,"yield-short-term",null,null,null,0,{"$f":"J6+K6","v":3.2193281673978067}]
[null,4,{"$f":"IF(B15=\"\", \"\", OFFSET(sample!$E$5, B15, 0))","v":0.21081451060917181},{"$f":"IF(B15=\"\", \"\", OFFSET(sample!$F$5, B15, 0))","v":3.2549999999999999},4,3.2549999999999999,{"$f":"IF(B15=\"\", \"\", TS!L31)","v":3.2852198003981972},null,0.21081451060917181,3.2549999999999999,3.2852198003981972,-3.0219800398197272E-2,null,0.33333333333333331,0.87379665462804135,null,{"$f":"config!B9","v":"Ridge-OLS"},null,"[0, 1]",null,"yield-medium-term",null,null,null,0,{"$f":"TS!L15","v":3.3459899637593122}]
[null,5,{"$f":"IF(B16=\"\", \"\", OFFSET(sample!$E$5, B16, 0))","v":0.38329911019849416},{"$f":"IF(B16=\"\", \"\", OFFSET(sample!$F$5, B16, 0))","v":3.3450000000000002},5,3.3450000000000002,{"$f":"IF(B16=\"\", \"\", TS!L32)","v":3.3321061284415294},null,0.38329911019849416,3.3450000000000002,3.3321061284415294,1.2893871558470771E-2,null,0.33333333333333331,0.87379665462804135,null,null,null,null,null,"yield-long-term",null,null,null,0,{"$f":"J6","v":1.0198645001986149}]
[null,6,{"$f":"IF(B17=\"\", \"\", OFFSET(sample!$E$5, B17, 0))","v":0.24914442162902123},{"$f":"IF(B17=\"\", \"\", OFFSET(sample!$F$5, B17, 0))","v":3.2549999999999999},6,3.2549999999999999,{"$f":"IF(B17=\"\", \"\", TS!L33)","v":3.296166278241488},null,0.24914442162902123,3.2549999999999999,3.296166278241488,-4.1166278241488108E-2,null,0.33333333333333331,0.87379665462804135,null,null,null,null,null,null,null,null,null,null,null,"Eliminated observations"]
[null,7,{"$f":"IF(B18=\"\", \"\", OFFSET(sample!$E$5, B18, 0))","v":5.7494866529774126E-2},{"$f":"IF(B18=\"\", \"\", OFFSET(sample!$F$5, B18, 0))","v":3.343},7,3.343,{"$f":"IF(B18=\"\", \"\", TS!L34)","v":3.2382788672446639},null,5.7494866529774126E-2,3.343,3.2382788672446639,0.10472113275533612,null,0.33333333333333331,0.87379665462804135,null,"Eliminated observations",null,null,null,null,null,"Elimination index mapping"]
[null,8,{"$f":"IF(B19=\"\", \"\", OFFSET(sample!$E$5, B19, 0))","v":0.32580424366872007},{"$f":"IF(B19=\"\", \"\", OFFSET(sample!$F$5, B19, 0))","v":3.2559999999999998},8,3.2559999999999998,{"$f":"IF(B19=\"\", \"\", TS!L35)","v":3.3171479765065519},null,0.32580424366872007,3.2559999999999998,3.3171479765065519,-6.1147976506552126E-2,null,0.33333333333333331,0.87379665462804135]
[null,"",{"$f":"IF(B20=\"\", \"\", OFFSET(sample!$E$5, B20, 0))","v":""},{"$f":"IF(B20=\"\", \"\", OFFSET(sample!$F$5, B20, 0))","v":""},"","",{"$f":"IF(B20=\"\", \"\", TS!L36)","v":""},null,null,null,null,null,null,0.33333333333333331,0.87379665462804135,null,"#","residuals","index","yield - ST","yield - LT",null,"#","final","original"]
{"$rows_left_out":31}
{"sheet":"TS","index":1,"n_rows":60,"n_cols":19,"rows_kept":60,"cut":false,"hidden":false,"merged":[]}
[]
[null,"TAB: YIELD FITTED TERM STRUCTURE"]
[]
[null,null,"α","β0","β1","β2",null,null,null,null,null,null,null,null,null,null,null,null,"Term structure"]
[null,"coefficient",{"$f":"calc!I6","v":0.33333333333333331},{"$f":"calc!J6","v":1.0198645001986149},{"$f":"calc!K6","v":2.1994636671991916},{"$f":"calc!L6","v":4.2166096237984663}]
[]
[null,"Full term structure",null,null,null,null,null,"Standard term structure",null,null,null,null,null,"Yields estimated from the term structure"]
[null,"Maturity","level","slope","curvature","yield",null,{"$f":"B8","v":"Maturity"},{"$f":"C8","v":"level"},"slope","curvature","yield",null,"Parameter",null,null,"Value"]
[null,0.01,1,{"$f":"(1 - EXP(-$C$5*$B9)) / ($C$5*$B9)","v":0.99833518364301777},{"$f":"(1 - EXP(-$C$5*$B9)) / ($C$5*$B9) - EXP(-$C$5*$B9)","v":1.6629675884944906E-3},{"$f":"SUMPRODUCT(D$5:F$5, C9:E9)","v":3.2226785494457761},null,0.25,1,{"$f":"(1 - EXP(-$C$5*$H9)) / ($C$5*$H9)","v":0.95946702444812049},{"$f":"(1 - EXP(-$C$5*$H9)) / ($C$5*$H9) - EXP(-$C$5*$H9)","v":3.9422609818797194E-2},{"$f":"SUMPRODUCT(D$5:F$5, I9:K9)","v":3.2964071163051667},null,"Long-term yield (level)",null,null,{"$f":"D5","v":1.0198645001986149}]
[null,1,1,{"$f":"(1 - EXP(-$C$5*$B10)) / ($C$5*$B10)","v":0.85040606827863219},{"$f":"(1 - EXP(-$C$5*$B10)) / ($C$5*$B10) - EXP(-$C$5*$B10)","v":0.13387475770484292},{"$f":"SUMPRODUCT(D$5:F$5, C10:E10)","v":3.4547993414651099},null,0.5,1,{"$f":"(1 - EXP(-$C$5*$H10)) / ($C$5*$H10)","v":0.92110965065631523},{"$f":"(1 - EXP(-$C$5*$H10)) / ($C$5*$H10) - EXP(-$C$5*$H10)","v":7.4627925765701097E-2},{"$f":"SUMPRODUCT(D$5:F$5, I10:K10)","v":3.360488540311493},null,"Short-term yield (level + slope)",null,null,{"$f":"D5+E5","v":3.2193281673978067}]
[null,{"$f":"B10+1","v":2},1,0.72987432145111197,0.21645720241851996,3.5379120747104236,null,1,1,0.85040606827863219,0.13387475770484292,3.4547993414651099,null,"Long-term premium (-slope)",null,null,{"$f":"-E5","v":-2.1994636671991916}]
[null,{"$f":"B11+1","v":3},1,0.63212055882855767,0.26424111765711533,3.524392342347932,null,{"$f":"H11+1","v":2},1,0.72987432145111197,0.21645720241851996,3.5379120747104236]
[null,4,1,0.55230214641320496,0.28870500829747819,3.4519893209765504,null,{"$f":"H12+1","v":3},1,0.63212055882855767,0.26424111765711533,3.524392342347932,null,"Actual yields"]
[null,5,1,0.48667463829746294,0.29779903545990105,3.3459899637593122,null,4,1,0.55230214641320496,0.28870500829747819,3.4519893209765504,null,"Longest maturity yield (level)",null,null,{"$f":"OFFSET(calc!D11, calc!D7, 0)","v":3.2559999999999998}]
[null,6,1,0.43233235838169365,0.29699707514508095,3.2230845399104346,null,5,1,0.48667463829746294,0.29779903545990105,3.3459899637593122,null,"Shortest maturity yield",null,null,{"$f":"calc!D12","v":3.5209999999999999}]
[null,7,1,0.38701201377239786,0.29004004590799276,3.0940690121231884,null,{"$f":"H15+2","v":7},1,0.38701201377239786,0.29004004590799276,3.0940690121231884,null,"Long-term premium",null,null,{"$f":"Q14-Q15","v":-0.26500000000000012}]
[null,8,1,0.34894370579144945,0.27946025456864793,2.965728301868082,null,8,1,0.34894370579144945,0.27946025456864793,2.965728301868082]
[null,9,1,0.31673764387737868,0.26695057550951473,2.8421438057131447,null,9,1,0.31673764387737868,0.26695057550951473,2.8421438057131447,null,"Mid-term maturity (τ)",null,null,{"$f":"curv!J8","v":4.8000000000000016}]
[null,10,1,0.28929780199582428,0.25362380864857187,2.7255970970610051,null,10,1,0.28929780199582428,0.25362380864857187,2.7255970970610051,null,null,null,null,null,null,"Slope"]
[null,11,1,0.26575594548913434,0.24019441228262695,2.617191117057676,null,{"$f":"H19+5","v":15},1,0.1986524106001829,0.19191446360109743,2.2660216338817607]
{"$rows_left_out":41}
{"sheet":"sample","index":2,"n_rows":36,"n_cols":13,"rows_kept":36,"cut":false,"hidden":false,"merged":[]}
[]
[null,"TAB: SAMPLE DATA",null,null,null,null,null,null,{"$f":"calc!D8","v":8}]
[]
[null,"Original Sample",null,null,null,null,null,null,"Final Sample"]
[null,"#","Transaction-specific Bloomberg code","Issuer Name","Tenor","Yield","is eliminated",null,{"$f":"B5","v":"#"},{"$f":"C5","v":"Transaction-specific Bloomberg code"},"Issuer Name","Tenor","Yield"]
[null,1,"QZ766903 Corp","MALAYSIA INVESTMNT ISSUE",1.5660506502395619,3.5209999999999999,{"$f":"IF(B6=\"\", \"\", IF(ISERROR(MATCH(B6, calc!$Y$21:$Y$50, 0)), 1, 0))","v":0},null,1,{"$f":"IF($I6=\"\", \"\", OFFSET(C$5, calc!$Y21, 0))","v":"QZ766903 Corp"},{"$f":"IF($I6=\"\", \"\", OFFSET(D$5, calc!$Y21, 0))","v":"MALAYSIA INVESTMNT ISSUE"},{"$f":"IF($I6=\"\", \"\", OFFSET(E$5, calc!$Y21, 0))","v":1.5660506502395619},{"$f":"IF($I6=\"\", \"\", OFFSET(F$5, calc!$Y21, 0))","v":3.5209999999999999}]
[null,{"$f":"IF(C7=\"\", \"\", B6+1)","v":2},"AU144805 Corp","MALAYSIA T-BILL",0.17248459958932238,3.2549999999999999,{"$f":"IF(B7=\"\", \"\", IF(ISERROR(MATCH(B7, calc!$Y$21:$Y$50, 0)), 1, 0))","v":0},null,{"$f":"IF(calc!W22=\"\", \"\", calc!W22)","v":2},{"$f":"IF($I7=\"\", \"\", OFFSET(C$5, calc!$Y22, 0))","v":"AU144805 Corp"},{"$f":"IF($I7=\"\", \"\", OFFSET(D$5, calc!$Y22, 0))","v":"MALAYSIA T-BILL"},{"$f":"IF($I7=\"\", \"\", OFFSET(E$5, calc!$Y22, 0))","v":0.17248459958932238},{"$f":"IF($I7=\"\", \"\", OFFSET(F$5, calc!$Y22, 0))","v":3.2549999999999999}]
[null,{"$f":"IF(C8=\"\", \"\", B7+1)","v":3},"AO724590 Corp","MALAYSIA GOVERNMENT",2.4038329911019849,3.548,{"$f":"IF(B8=\"\", \"\", IF(ISERROR(MATCH(B8, calc!$Y$21:$Y$50, 0)), 1, 0))","v":0},null,{"$f":"IF(calc!W23=\"\", \"\", calc!W23)","v":3},{"$f":"IF($I8=\"\", \"\", OFFSET(C$5, calc!$Y23, 0))","v":"AO724590 Corp"},{"$f":"IF($I8=\"\", \"\", OFFSET(D$5, calc!$Y23, 0))","v":"MALAYSIA GOVERNMENT"},{"$f":"IF($I8=\"\", \"\", OFFSET(E$5, calc!$Y23, 0))","v":2.4038329911019849},{"$f":"IF($I8=\"\", \"\", OFFSET(F$5, calc!$Y23, 0))","v":3.548}]
[null,4,"AU365855 Corp","MALAYSIA T-BILL",0.21081451060917181,3.2549999999999999,{"$f":"IF(B9=\"\", \"\", IF(ISERROR(MATCH(B9, calc!$Y$21:$Y$50, 0)), 1, 0))","v":0},null,{"$f":"IF(calc!W24=\"\", \"\", calc!W24)","v":4},{"$f":"IF($I9=\"\", \"\", OFFSET(C$5, calc!$Y24, 0))","v":"AU365855 Corp"},{"$f":"IF($I9=\"\", \"\", OFFSET(D$5, calc!$Y24, 0))","v":"MALAYSIA T-BILL"},{"$f":"IF($I9=\"\", \"\", OFFSET(E$5, calc!$Y24, 0))","v":0.21081451060917181},{"$f":"IF($I9=\"\", \"\", OFFSET(F$5, calc!$Y24, 0))","v":3.2549999999999999}]
[null,5,"AR129958 Corp","MALAYSIA ISLAMIC T-BILL",0.38329911019849416,3.3450000000000002,{"$f":"IF(B10=\"\", \"\", IF(ISERROR(MATCH(B10, calc!$Y$21:$Y$50, 0)), 1, 0))","v":0},null,{"$f":"IF(calc!W25=\"\", \"\", calc!W25)","v":5},{"$f":"IF($I10=\"\", \"\", OFFSET(C$5, calc!$Y25, 0))","v":"AR129958 Corp"},{"$f":"IF($I10=\"\", \"\", OFFSET(D$5, calc!$Y25, 0))","v":"MALAYSIA ISLAMIC T-BILL"},{"$f":"IF($I10=\"\", \"\", OFFSET(E$5, calc!$Y25, 0))","v":0.38329911019849416},{"$f":"IF($I10=\"\", \"\", OFFSET(F$5, calc!$Y25, 0))","v":3.3450000000000002}]
[null,6,"AR793937 Corp","MALAYSIA T-BILL",0.24914442162902123,3.2549999999999999,{"$f":"IF(B11=\"\", \"\", IF(ISERROR(MATCH(B11, calc!$Y$21:$Y$50, 0)), 1, 0))","v":0},null,{"$f":"IF(calc!W26=\"\", \"\", calc!W26)","v":6},{"$f":"IF($I11=\"\", \"\", OFFSET(C$5, calc!$Y26, 0))","v":"AR793937 Corp"},{"$f":"IF($I11=\"\", \"\", OFFSET(D$5, calc!$Y26, 0))","v":"MALAYSIA T-BILL"},{"$f":"IF($I11=\"\", \"\", OFFSET(E$5, calc!$Y26, 0))","v":0.24914442162902123},{"$f":"IF($I11=\"\", \"\", OFFSET(F$5, calc!$Y26, 0))","v":3.2549999999999999}]
[null,7,"AT536680 Corp","MALAYSIA ISLAMIC T-BILL",5.7494866529774126E-2,3.343,{"$f":"IF(B12=\"\", \"\", IF(ISERROR(MATCH(B12, calc!$Y$21:$Y$50, 0)), 1, 0))","v":0},null,{"$f":"IF(calc!W27=\"\", \"\", calc!W27)","v":7},{"$f":"IF($I12=\"\", \"\", OFFSET(C$5, calc!$Y27, 0))","v":"AT536680 Corp"},{"$f":"IF($I12=\"\", \"\", OFFSET(D$5, calc!$Y27, 0))","v":"MALAYSIA ISLAMIC T-BILL"},{"$f":"IF($I12=\"\", \"\", OFFSET(E$5, calc!$Y27, 0))","v":5.7494866529774126E-2},{"$f":"IF($I12=\"\", \"\", OFFSET(F$5, calc!$Y27, 0))","v":3.343}]
[null,8,"AQ803695 Corp","MALAYSIA T-BILL",0.32580424366872007,3.2559999999999998,{"$f":"IF(B13=\"\", \"\", IF(ISERROR(MATCH(B13, calc!$Y$21:$Y$50, 0)), 1, 0))","v":0},null,{"$f":"IF(calc!W28=\"\", \"\", calc!W28)","v":8},{"$f":"IF($I13=\"\", \"\", OFFSET(C$5, calc!$Y28, 0))","v":"AQ803695 Corp"},{"$f":"IF($I13=\"\", \"\", OFFSET(D$5, calc!$Y28, 0))","v":"MALAYSIA T-BILL"},{"$f":"IF($I13=\"\", \"\", OFFSET(E$5, calc!$Y28, 0))","v":0.32580424366872007},{"$f":"IF($I13=\"\", \"\", OFFSET(F$5, calc!$Y28, 0))","v":3.2559999999999998}]
[null,"",null,null,null,null,{"$f":"IF(B14=\"\", \"\", IF(ISERROR(MATCH(B14, calc!$Y$21:$Y$50, 0)), 1, 0))","v":""},null,{"$f":"IF(calc!W29=\"\", \"\", calc!W29)","v":""},{"$f":"IF($I14=\"\", \"\", OFFSET(C$5, calc!$Y29, 0))","v":""},{"$f":"IF($I14=\"\", \"\", OFFSET(D$5, calc!$Y29, 0))","v":""},{"$f":"IF($I14=\"\", \"\", OFFSET(E$5, calc!$Y29, 0))","v":""},{"$f":"IF($I14=\"\", \"\", OFFSET(F$5, calc!$Y29, 0))","v":""}]
[null,"",null,null,null,null,{"$f":"IF(B15=\"\", \"\", IF(ISERROR(MATCH(B15, calc!$Y$21:$Y$50, 0)), 1, 0))","v":""},null,{"$f":"IF(calc!W30=\"\", \"\", calc!W30)","v":""},{"$f":"IF($I15=\"\", \"\", OFFSET(C$5, calc!$Y30, 0))","v":""},{"$f":"IF($I15=\"\", \"\", OFFSET(D$5, calc!$Y30, 0))","v":""},{"$f":"IF($I15=\"\", \"\", OFFSET(E$5, calc!$Y30, 0))","v":""},{"$f":"IF($I15=\"\", \"\", OFFSET(F$5, calc!$Y30, 0))","v":""}]
[null,"",null,null,null,null,{"$f":"IF(B16=\"\", \"\", IF(ISERROR(MATCH(B16, calc!$Y$21:$Y$50, 0)), 1, 0))","v":""},null,{"$f":"IF(calc!W31=\"\", \"\", calc!W31)","v":""},{"$f":"IF($I16=\"\", \"\", OFFSET(C$5, calc!$Y31, 0))","v":""},{"$f":"IF($I16=\"\", \"\", OFFSET(D$5, calc!$Y31, 0))","v":""},{"$f":"IF($I16=\"\", \"\", OFFSET(E$5, calc!$Y31, 0))","v":""},{"$f":"IF($I16=\"\", \"\", OFFSET(F$5, calc!$Y31, 0))","v":""}]
[null,"",null,null,null,null,{"$f":"IF(B17=\"\", \"\", IF(ISERROR(MATCH(B17, calc!$Y$21:$Y$50, 0)), 1, 0))","v":""},null,{"$f":"IF(calc!W32=\"\", \"\", calc!W32)","v":""},{"$f":"IF($I17=\"\", \"\", OFFSET(C$5, calc!$Y32, 0))","v":""},{"$f":"IF($I17=\"\", \"\", OFFSET(D$5, calc!$Y32, 0))","v":""},{"$f":"IF($I17=\"\", \"\", OFFSET(E$5, calc!$Y32, 0))","v":""},{"$f":"IF($I17=\"\", \"\", OFFSET(F$5, calc!$Y32, 0))","v":""}]
[null,"",null,null,null,null,{"$f":"IF(B18=\"\", \"\", IF(ISERROR(MATCH(B18, calc!$Y$21:$Y$50, 0)), 1, 0))","v":""},null,{"$f":"IF(calc!W33=\"\", \"\", calc!W33)","v":""},{"$f":"IF($I18=\"\", \"\", OFFSET(C$5, calc!$Y33, 0))","v":""},{"$f":"IF($I18=\"\", \"\", OFFSET(D$5, calc!$Y33, 0))","v":""},{"$f":"IF($I18=\"\", \"\", OFFSET(E$5, calc!$Y33, 0))","v":""},{"$f":"IF($I18=\"\", \"\", OFFSET(F$5, calc!$Y33, 0))","v":""}]
[null,"",null,null,null,null,{"$f":"IF(B19=\"\", \"\", IF(ISERROR(MATCH(B19, calc!$Y$21:$Y$50, 0)), 1, 0))","v":""},null,{"$f":"IF(calc!W34=\"\", \"\", calc!W34)","v":""},{"$f":"IF($I19=\"\", \"\", OFFSET(C$5, calc!$Y34, 0))","v":""},{"$f":"IF($I19=\"\", \"\", OFFSET(D$5, calc!$Y34, 0))","v":""},{"$f":"IF($I19=\"\", \"\", OFFSET(E$5, calc!$Y34, 0))","v":""},{"$f":"IF($I19=\"\", \"\", OFFSET(F$5, calc!$Y34, 0))","v":""}]
[null,"",null,null,null,null,{"$f":"IF(B20=\"\", \"\", IF(ISERROR(MATCH(B20, calc!$Y$21:$Y$50, 0)), 1, 0))","v":""},null,{"$f":"IF(calc!W35=\"\", \"\", calc!W35)","v":""},{"$f":"IF($I20=\"\", \"\", OFFSET(C$5, calc!$Y35, 0))","v":""},{"$f":"IF($I20=\"\", \"\", OFFSET(D$5, calc!$Y35, 0))","v":""},{"$f":"IF($I20=\"\", \"\", OFFSET(E$5, calc!$Y35, 0))","v":""},{"$f":"IF($I20=\"\", \"\", OFFSET(F$5, calc!$Y35, 0))","v":""}]
{"$rows_left_out":17}
{"sheet":"curv","index":3,"n_rows":75,"n_cols":10,"rows_kept":75,"cut":false,"hidden":false,"merged":[]}
[]
[null,"TAB: CALCULATION OF CURVATURE PROXY USING YIELDS"]
[]
[null,"dx",0.1,null,null,null,null,null,null,"τ:  (1 - e-x) / x = 0.5"]
[null,"#","x","(1 - e-x) / x","(1 - e-x) / x - e-x","y = 0.5",null,"Method","α","τ"]
[null,1,{"$f":"C4","v":0.1},{"$f":"(1 - EXP(-C6)) / C6","v":0.95162581964040482},{"$f":"D6 - EXP(-C6)","v":4.6788401604445307E-2},0.5,null,{"$f":"calc!Q12","v":"Diebold-Li"},{"$f":"calc!S12","v":0.72992700729927007},{"$f":"$C$21/I6","v":2.1920000000000006}]
[null,{"$f":"B6+1","v":2},{"$f":"C6+$C$4","v":0.2},{"$f":"(1 - EXP(-C7)) / C7","v":0.9063462346100909},{"$f":"D7 - EXP(-C7)","v":8.7615481532109074E-2},0.5,null,{"$f":"calc!Q13","v":"Fabozzi"},{"$f":"calc!S13","v":0.33333333333333331},{"$f":"$C$21/I7","v":4.8000000000000016}]
[null,{"$f":"B7+1","v":3},{"$f":"C7+$C$4","v":0.30000000000000004},{"$f":"(1 - EXP(-C8)) / C8","v":0.8639392643942736},0.12312104371255572,0.5,null,"Selected",{"$f":"calc!I6","v":0.33333333333333331},4.8000000000000016]
[null,4,0.4,0.82419988491090168,0.15387983887526235,0.5]
[null,5,0.5,0.78693868057473315,0.18040802086209973,0.5]
[null,6,0.6,0.75198060650995602,0.20316897041592963,0.5]
[null,7,0.7,0.71916385172655783,0.22257854793514831,0.5]
[null,8,0.79999999999999993,0.68833879485347316,0.23900983073625154,0.5]
[null,9,0.89999999999999991,0.65936704473266761,0.25279738499206844,0.5]
[null,10,0.99999999999999989,0.63212055882855778,0.26424111765711539,0.5]
[null,11,1.0999999999999999,0.60648083300174593,0.27360974930366633,0.5]
[null,12,1.2,0.58233815673983158,0.28114394482762944,0.5]
[null,13,1.3,0.55959092843537495,0.28705913540136235,0.5]
[null,14,1.4000000000000001,0.53814502575599532,0.29154806181438886,0.5]
[null,15,1.5000000000000002,0.51791322656771344,0.29478306641928365,0.5]
{"$rows_left_out":56}
{"sheet":"config","index":4,"n_rows":29,"n_cols":9,"rows_kept":29,"cut":false,"hidden":false,"merged":[]}
[]
[null,"TAB: CONFIGURATION FILE",null,"Calculation enabled",null,true]
[null,null,null,"Test connection",null,{"$f":"_xll.AC.test.connection()","v":"host: CA2013466W3; user: Konstantin.Rybakov; key: null"}]
[]
[null,"Term structure estimation methods",null,"Term structure output keys",null,null,null,"Alpha (α) range"]
[null,"Diebold-Li",null,"TS-coeffs",null,"Array of term structure regression coefficients",null,"minimum",0.1]
[null,"Fabozzi",null,"TS-term-structure",null,"Term structure yields",null,"maximum",1]
[null,"Nelson-Siegel",null,"TS-elimination-data",null,"Elimnated sample observations",null,"delta",0.05]
[null,"Ridge-OLS",null,"TS-index-mapping",null,"Mapping between the indices of original and final samples"]
[null,null,null,"TS-R2",null,"Mapping sample index => R2 (term structure ols)"]
[]
[null,"Array formula cell address","number of rows","number of \ncols","Description"]
[null,{"$f":"addressFla(calc!I12)","v":"'calc'!$I$12"},{"$f":"calc!D8","v":8},4,"Final sample and term structure"]
[null,{"$f":"addressFla(calc!N12)","v":"'calc'!$N$12"},18,2,"R2(α) sequence of values"]
[null,{"$f":"addressFla(calc!R21)","v":"'calc'!$R$21"},{"$f":"calc!Y13","v":0},4,"Elimination output array"]
[null,{"$f":"addressFla(calc!X21)","v":"'calc'!$X$21"},{"$f":"calc!D8","v":8},2,"Index mapping for the final sample"]
[]
[]
[]
[null,"Graph configuration"]
{"$rows_left_out":10}
{"sheet":"guide","index":5,"n_rows":2,"n_cols":2,"rows_kept":2,"cut":false,"hidden":false,"merged":[[1,1,32,8]]}
[]
[null,"Package: IRB.YTS\n\nAvailable functions for term structure estimation:\n\nCalculatorNelsonSiegel calc = calcTS(Map<Double, Double> sample, String method)\nwhere sample is the mapping t => y[t] of maturity term into related yield rate and method parameter is the method used to estimate the term structure. The list of methods includes:\n     Diebold-Li\n     Fabozzi \n     Nelson-Siegel\n     Ridge-OLS\n\ndouble[][] (double[]) CalculatorNelsonSiegel calc, String key)\nwhere key represents the key for a specific retrieved field. The following keys can be used:\n1. TS-coeffs: coefficients of the term structure (as a list (α, β0, β1, β2);\n2. TS-yields-fitted: fitted term structure values;\n3. TS-R2: the values R2(α) for a grid of α values;\n\n\nShort cut key combinations: \nCtrl+Shft+C - calculate all; Ctrl+Shift+R - refresh addin; Ctrl+Shft+S - set the data ranges; \nCtrl+Shft+D - disable calculations; Ctrl+Shft+G - update graphs, Ctrl+Shft+H - highlight the graph used as a reference"]