{"text_format":"1","workbook":"xlsx","n_sheets":6,"sheets":["charts","test","data","calc","config","guide"],"not_rendered":{"charts":6,"images":0,"macros":1,"external_links":0,"defined_names":9,"comments":0,"pivot_tables":0},"unopened":[],"bounds":{"document_bytes":16777216,"sheet_cells":100000,"rows_first":2000,"rows_last":500,"rows_between":2000,"halvings":0,"cell_chars":16384,"cell_head_chars":4096},"cells_cut":0,"cells_raw":0,"read":"whole","date_system":"1900"}

{"sheet":"charts","index":0,"n_rows":21,"n_cols":14,"rows_kept":21,"cut":false,"hidden":false,"merged":[]}
[]
[null,"TAB: CHARTS"]
[]
[null,{"$f":"calc!D10 & \" probability distribution function (pdf)\"","v":"Normal probability distribution function (pdf)"},null,null,null,null,null,{"$f":"calc!D10 & \" cumulative probability distribution function (cdf)\"","v":"Normal cumulative probability distribution function (cdf)"},null,null,null,null,null,"Historical sample"]
[]
[]
[]
[]
[]
[]
[]
[]
[]
[]
[]
[]
[]
[]
[]
[]
{"$rows_left_out":2}
{"sheet":"test","index":1,"n_rows":63,"n_cols":27,"rows_kept":63,"cut":false,"hidden":false,"merged":[[8,2,8,4],[8,21,8,23],[8,24,8,26],[29,3,29,4]]}
[]
[null,"TAB: DISTRIBUTION TESTS AND SAMPLE HISTOGRAM"]
[]
[null,"Selected distribution",null,null,null,null,"Histogram",null,null,null,null,null,null,null,null,null,null,"Distribution tests"]
[]
[null,"Sample size",{"$f":"calc!D23","v":175},null,null,null,{"$f":"calc!I8","v":"Matched or alternative distribution based on generated sampe"},null,null,null,null,null,{"$f":"calc!I14","v":"Matched distribution based on historical sample"},null,null,null,null,null,"Test",{"$f":"calc!K24","v":"Kolmogorov-Smirnov"}]
[null,null,null,null,null,null,null,null,null,null,null,null,null,null,null,null,null,null,"Sample",{"$f":"IF(calc!K23=1, \"Historical\", \"Generated\")","v":"Historical"}]
[null,null,null,null,null,null,null,null,{"$f":"SUM(I11:I34)","v":0.67428571428571404},null,{"$f":"SUM(K11:K34)","v":0.74141203050473259},null,null,{"$f":"SUM(N11:N34)","v":0.75428571428571412},null,{"$f":"SUM(P11:P34)","v":0.71132059605026188}]
[null,"Name","Parameters",null,null,null,null,null,null,null,null,null,null,null,null,null,null,null,null,null,null,"Parameters",null,null,"Statistics"]
[null,null,"p1","p2","p3",null,"#","x","histogram - matched distribution","normal fit - matched distribution",{"$f":"\"pdf - \" & calc!$D$10","v":"pdf - Normal"},null,{"$f":"H10","v":"x"},"histogram","normal fit - actual distribution",{"$f":"calc!$D$16 & \" distribution\"","v":"Normal distribution"},null,"#","Distribution","statistics","p-value","p1","p2","p3","mean","stdev","mode"]
[null,{"$f":"IF(calc!K23=1, calc!D16, calc!D10)","v":"Normal"},{"$f":"IF(calc!$K$23=1, IF(config!T17=\"\", \"\", config!T17), IF(config!T8=\"\", \"\", config!T8))","v":"mean"},{"$f":"IF(calc!$K$23=1, IF(config!U17=\"\", \"\", config!U17), IF(config!U8=\"\", \"\", config!U8))","v":"stdev"},{"$f":"IF(calc!$K$23=1, IF(config!V17=\"\", \"\", config!V17), IF(config!V8=\"\", \"\", config!V8))","v":""},null,1,{"$f":"_xll.AC.data._get(calc!K11, \"\", 0)","v":7.48293464837156E-2},5.7142857142857134E-3,1.0731493673897736E-3,{"$f":"_xll.AC.data._get(calc!K13, \"\", 0)","v":8.9710036273984517E-4},null,{"$f":"_xll.AC.data._get(calc!K17, \"\", 0)","v":6.5595637847907964E-2},1.1428571428571427E-2,7.5154584035611418E-4,{"$f":"_xll.AC.data._get(calc!K19, \"\", 0)","v":7.515458403561157E-4},null,1,{"$f":"B11","v":"Normal"},null,{"$f":"_xll.AC.stats.distrib.get(calc!K26, config!N27)","v":0.25307618412590038},{"$f":"IF(C12=\"\", \"\", C12)","v":0.45746052873075166},{"$f":"IF(D12=\"\", \"\", D12)","v":0.14596581623061439},{"$f":"IF(E12=\"\", \"\", E12)","v":""}]
[null,null,{"$f":"IF(calc!$K$23=1, IF(config!T18=\"\", \"\", config!T18), IF(config!T9=\"\", \"\", config!T9))","v":0.45746052873075166},{"$f":"IF(calc!$K$23=1, IF(config!U18=\"\", \"\", config!U18), IF(config!U9=\"\", \"\", config!U9))","v":0.14596581623061439},{"$f":"IF(calc!$K$23=1, IF(config!V18=\"\", \"\", config!V18), IF(config!V9=\"\", \"\", config!V9))","v":""},null,{"$f":"G11+1","v":2},9.5216796867698017E-2,0,2.9601387254624299E-3,2.5623893375289093E-3,null,8.579622106441856E-2,5.7142857142857134E-3,2.1586463292416762E-3,2.158646329241684E-3]
[null,null,null,null,null,null,{"$f":"IF(G12>=$D$34, \"\", G12+1)","v":3},0.11560424725168043,0,4.0134659826570832E-3,3.5887795562207061E-3,null,0.10599680428092915,1.1428571428571427E-2,3.0413030034001278E-3,3.0413030034001339E-3,null,1,{"$f":"config!C8","v":"Beta"},null,{"$f":"_xll.AC.data._get(calc!K32, \"\", 0)","v":1.7070789226636407E-12},{"$f":"_xll.AC.data._get(calc!K31, \"X\", 0)","v":1.0000000000000001E-5},1.1859809474154039E-5,"",{"$f":"V13/(V13+W13)","v":0.45746052873075166},null,{"$f":"(V13-1)/(V13+W13-2)","v":0.50000046495745054}]
[null,"Matching between generated and theoretical statistics",null,null,null,null,4,0.13599169763566285,1.714285714285714E-2,5.3494943720393991E-3,4.9291952262110134E-3,null,0.12619738749743975,0,4.2035872140150357E-3,4.2035872140150435E-3,null,{"$f":"R13+1","v":2},{"$f":"config!C9","v":"Chi-squred "},null,4.0731862327447743E-12,0.45746052873075166,"","",{"$f":"V14","v":0.45746052873075166}]
[null,null,null,null,null,null,5,0.15637914801964525,1.1428571428571427E-2,7.009572151106775E-3,6.6394610787477984E-3,null,0.14639797071395033,1.1428571428571427E-2,5.6998392598824089E-3,5.6998392598824211E-3,null,{"$f":"R14+1","v":3},{"$f":"config!C10","v":"Exponential"},null,1.063815702195825E-12,2.1859809474154037,"","",{"$f":"1/V15","v":0.45746052873075166}]
[null,{"$f":"calc!B8","v":"Matched or alternative distribution based on generated sampe"},null,null,null,null,6,0.17676659840362768,5.7142857142857134E-3,9.0293380447354875E-3,8.7703558067234923E-3,null,0.16659855393046091,0,7.5820619551258909E-3,7.5820619551259065E-3,null,4,{"$f":"config!C11","v":"Fisher"},null,1.0700329511337259E-12,1,1,"",{"$f":"V16/(V16-2)","v":-1},null,{"$f":"V16*(W16-2) / (W16*(V16+2))","v":-0.33333333333333331}]
[null,"Statistics","Generated","Theoretical","Sample",null,7,0.19715404878761009,5.7142857142857134E-3,1.1434204143531046E-2,1.1361329863652606E-2,null,0.18679913714697149,1.714285714285714E-2,9.8945084505863562E-3,9.8945084505863753E-3,null,5,{"$f":"config!C12","v":"Gamma"},null,0,9.8221131952556355,21.470952308186249,"",{"$f":"V17/W17","v":0.45746052873075171},{"$f":"SQRT(V17/(W17*W17))","v":0.14596581623061439}]
[null,"Mean",{"$f":"data!E4","v":0.46752569919855319},{"$f":"IF(OFFSET(config!M7, calc!$D$9, 0)=\"\", \"\", OFFSET(config!M7, calc!$D$9, 0))","v":0.45746052873075166},{"$f":"_xll.AC.stats.sample.moment.mean(calc!D26)","v":0.46894419185177938},null,8,0.21754149917159249,1.714285714285714E-2,1.4234479707787382E-2,1.4433401709487174E-2,null,0.20699972036348213,1.1428571428571427E-2,1.2667277746460624E-2,1.2667277746460648E-2,null,6,{"$f":"config!C13","v":"Geometric"},null,0,1,"","",{"$f":"1/V18","v":1}]
[null,"Standard deviation",{"$f":"data!E5","v":0.13781207708240079},{"$f":"IF(OFFSET(config!N7, calc!$D$9, 0)=\"\", \"\", OFFSET(config!N7, calc!$D$9, 0))","v":0.14596581623061439},{"$f":"_xll.AC.stats.sample.moment.stdev(calc!D26)","v":0.15603350069368488},null,9,0.23792894955557492,2.8571428571428567E-2,1.7420590833121041E-2,1.7981909268456345E-2,null,0.22720030357999271,1.1428571428571427E-2,1.5909426953386409E-2,1.5909426953386437E-2,null,7,{"$f":"config!C14","v":"Laplace"},null,0.3612333069305802,0.45746052873075166,0.10321341847809684,"",{"$f":"V19","v":0.45746052873075166},{"$f":"SQRT(2*W19*W19)","v":0.14596581623061436}]
[null,"Mode",{"$f":"data!E6","v":0.4576392363983029},{"$f":"IF(OFFSET(config!O7, calc!$D$9, 0)=\"\", \"\", OFFSET(config!O7, calc!$D$9, 0))","v":""},{"$f":"_xll.AC.stats.sample.moment.mode(calc!D27)","v":0.51264991961555673},null,10,0.25831639993955735,1.714285714285714E-2,2.0958962948294021E-2,2.1970021310357902E-2,null,0.24740088679650329,2.2857142857142854E-2,1.9602341692866475E-2,1.960234169286651E-2,null,8,{"$f":"config!C15","v":"Logistic"},null,0.33719793505033391,0.45746052873075166,8.047517223176491E-2,"",{"$f":"V20","v":0.45746052873075166},{"$f":"SQRT(PI()*PI()*W20*W20/3)","v":0.14596581623061439}]
{"$rows_left_out":44}
{"sheet":"data","index":2,"n_rows":240,"n_cols":16,"rows_kept":240,"cut":false,"hidden":false,"merged":[]}
[]
[null,"TAB: GENERATED AND HISTORICAL SAMPLES AND DISTRIBUTIONS"]
[]
[null,null,"Mean",{"$f":"AVERAGE(D9:D500)","v":0.46894419185177938},{"$f":"SUMPRODUCT(E9:E502, F9:F502, G9:G502)","v":0.46752569919855319},null,null,null,null,null,null,{"$f":"AVERAGE(L9:L500)","v":0.45746052873075166},{"$f":"SUMPRODUCT(M9:M502, N9:N502, O9:O502)","v":0.46487001578006271}]
[null,null,"Stdev",{"$f":"STDEV(D9:D500)","v":0.15603350069368413},{"$f":"SQRT(SUMPRODUCT(E9:E502, E9:E502, F9:F502, G9:G502) - E4*E4)","v":0.13781207708240079},null,null,null,null,null,null,{"$f":"STDEV(L9:L500)","v":0.14596581623061591},{"$f":"SQRT(SUMPRODUCT(M9:M502, M9:M502, N9:N502, O9:O502) - M4*M4)","v":0.1398713546786689}]
[null,null,"Mode",null,{"$f":"OFFSET(E8, F6, 0)","v":0.4576392363983029},{"$f":"MATCH(MAX(G9:G500), G9:G500, 0)","v":82},null,"Generated",null,null,null,null,{"$f":"OFFSET(M8, N6, 0)","v":0.4574966955772134},{"$f":"MATCH(MAX(O9:O500), O9:O500, 0)","v":81},null,"Historical"]
[null,null,"Generated sample",null,null,{"$f":"calc!D23","v":175},null,"u*=F*(β)",null,"Historical sample",null,null,null,null,null,"u=F(x)"]
[null,"#","cdf - uniform","sample","sorted sample","sample increment",{"$f":"test!K10","v":"pdf - Normal"},{"$f":"\"cdf - \" & calc!$D$10","v":"cdf - Normal"},null,"#","Date","Value","sorted sample","sample increment",{"$f":"test!P10","v":"Normal distribution"},{"$f":"\"cdf - \" & calc!$D$16","v":"cdf - Normal"}]
[null,1,{"$f":"1/calc!D23","v":5.7142857142857143E-3},{"$f":"_xll.AC.data._get(calc!D26, \"\", 0)","v":0.37887514897993374},{"$f":"_xll.AC.data._get(calc!D27, \"\", 0)","v":6.9669559658139812E-2},{"$f":"IF($B10=\"\", \"\", E10-E9)","v":6.3289484853194022E-2},{"$f":"_xll.AC.data._get(calc!D28, \"\", 0)","v":8.016659195175288E-2},{"$f":"_xll.AC.data._get(calc!D29, \"\", 0)","v":3.9451940423096583E-3},null,1,"     AARON",0.18168982755953747,{"$f":"_xll.AC.data._get(calc!D32, \"\", 0)","v":6.0483144564717019E-2},{"$f":"IF($B10=\"\", \"\", M10-M9)","v":6.1056041094838878E-3},{"$f":"_xll.AC.data._get(calc!D33, \"\", 0)","v":6.7689051752678739E-2},{"$f":"_xll.AC.data._get(calc!D34, \"\", 0)","v":3.2674540751870757E-3}]
[null,{"$f":"IF(B9=\"\", \"\", IF(B9<$F$7, B9+1, \"\"))","v":2},{"$f":"IF(B10=\"\", \"\", C9+$C$9)","v":1.1428571428571429E-2},0.345988271612095,0.13295904451133383,{"$f":"IF($B11=\"\", \"\", E11-E10)","v":9.1031914203421604E-3},0.23091241080731356,1.310340236057383E-2,null,{"$f":"IF(K10=\"\", \"\", J9+1)","v":2},"     ACADI",0.41179261986816906,6.6588748674200907E-2,{"$f":"IF($B11=\"\", \"\", M11-M10)","v":2.5588801168252462E-2},7.5778171236395922E-2,3.7050303812414956E-3]
[null,3,1.7142857142857144E-2,0.28920468858820053,0.142062235931676,2.9852134178542933E-4,0.26473781968208798,1.5356625153251518E-2,null,{"$f":"IF(K11=\"\", \"\", J10+1)","v":3},"     AGELL",0.51791755388169347,9.2177549842453368E-2,9.9208857427697944E-3,0.11932919609653928,6.1655607734921458E-3]
[null,4,2.2857142857142857E-2,0.47203866949252554,0.14236075727346142,1.2861677919053627E-2,0.26590975139205431,1.5435829864552058E-2,null,4,"     AGREE",0.36365250328138771,0.10209843558522316,9.6807203707417744E-4,0.14112778851852492,7.4550165760055888E-3]
[null,5,2.8571428571428571E-2,0.25518292764552419,0.15522243519251505,6.1866403018259186E-3,0.32037407809230029,1.91976877821326E-2,null,5,"     ALEXA",0.28020380398538158,0.10306650762229734,4.2854175456572538E-2,0.14342183978779313,7.5927463659193799E-3]
[null,6,3.4285714285714287E-2,0.48205452980440383,0.16140907549434097,1.4438213954970025E-2,0.34944708046917478,2.1268667244834807E-2,null,6,"     ALEXA02",0.73236762370161335,0.14592068307886988,6.7032918226244964E-3,0.28020126574304843,1.6407713442035066E-2]
[null,7,0.04,6.9669559658139812E-2,0.175847289449311,1.8374492725066749E-2,0.42499693118856141,2.6846224115209313E-2,null,7,"     ALEXA03",0.41743274866967711,0.15262397490149437,2.9065852658043095E-2,0.30873095639733816,1.8380407303734247E-2]
[null,8,4.5714285714285714E-2,0.27899031754481796,0.19422178217437774,1.8135557147963E-2,0.53755143325377575,3.5660562013732522E-2,null,8,"     ALGOM",0.24394988628677991,0.18168982755953747,5.0368426367485841E-3,0.4587497613208053,2.9426974713982965E-2]
[null,9,5.1428571428571428E-2,0.55646439581265883,0.21235733932234074,1.160965860666191E-3,0.66738911871003792,4.655827732284451E-2,null,9,"     ALGOM02",0.25257020720852813,0.18672667019628605,9.4971738602814271E-4,0.48936224167214704,3.1814127064870634E-2]
[null,10,5.7142857142857141E-2,0.56478041006194224,0.21351830518300693,2.5800451873839447E-3,0.67634095101694891,4.7338282263819587E-2,null,10,"     ALLEG",6.6588748674200907E-2,0.1876763875823142,2.2426429561899774E-2,0.49529315051484524,3.2281695232311163E-2]
[null,11,6.2857142857142861E-2,0.51557475800266905,0.21609835037039088,1.8735686714811434E-2,0.69650933793092429,4.9109208845782404E-2,null,11,"     ALLIE",0.380430422789788,0.21010281714421397,5.4167253275274885E-3,0.6502247613276535,4.5073036960229629E-2]
[null,12,6.8571428571428575E-2,0.55911729121414688,0.23483403708520231,2.2575549125458394E-3,0.85413393587656938,6.3605098242295988E-2,null,12,"     AMERC",0.33024991097082107,0.21551954247174146,4.7293877790954009E-3,0.6919518663840265,4.870738360634802E-2]
{"$rows_left_out":221}
{"sheet":"calc","index":3,"n_rows":35,"n_cols":16,"rows_kept":35,"cut":false,"hidden":false,"merged":[]}
[]
[null,"TAB: DISTRIBUTION CALCULATOR"]
[]
[]
[null,"Distribution Object",null,null,null,null,null,null,"Distribution Histogram"]
[null,null,null,null,null,null,null,null,null,null,null,null,null,null,null," "]
[null,"Object Description","Abbr","Object value","Parameters",null,null,null,"Object Description","Abbr","Object value",null,null,null,null," "]
[null,"Matched or alternative distribution based on generated sampe",null,null,null,null,null,null,{"$f":"B8","v":"Matched or alternative distribution based on generated sampe"}]
[null,"Distribution index",null,{"$f":"D15","v":10},{"$f":"IF(OFFSET(config!E7, $D$9,0)=\"\", \"\", OFFSET(config!E7, $D$9,0))","v":"mean"},{"$f":"IF(OFFSET(config!F7, $D$9,0)=\"\", \"\", OFFSET(config!F7, $D$9,0))","v":"stdev"},{"$f":"IF(OFFSET(config!G7, $D$9,0)=\"\", \"\", OFFSET(config!G7, $D$9,0))","v":""}," ","Histogram parameters",null,{"$f":"_xll.AC.data.map(test!C32:C34, test!D32:D34)","v":"java.util.LinkedHashMap@Mon, 3 Dec 2018 14:12:30:350..8127087316467667413"},null,null,null,{"$f":"_xll.AC.data.size(K9, 1)","v":3}," "]
[null,"Distribution",null,{"$f":"config!C17","v":"Normal"},{"$f":"IF(OFFSET(test!V12, $D$9,0)=\"\", \"\", OFFSET(test!V12, $D$9,0))","v":0.45746052873075166},{"$f":"IF(OFFSET(test!W12, $D$9,0)=\"\", \"\", OFFSET(test!W12, $D$9,0))","v":0.14596581623061439},{"$f":"IF(OFFSET(test!X12, $D$9,0)=\"\", \"\", OFFSET(test!X12, $D$9,0))","v":""}," ","Histogram object","H(x)",{"$f":"_xll.AC.stats.sample.calc.hist(D27, K9)","v":"jmathkr.lib.stats.basic.calc.Histogram@Mon, 3 Dec 2018 14:23:36:629..2347371617678546836"},null,null,null," "," "]
[null,"Distribution object parameters",null,{"$f":"_xll.AC.data.map(E9:F9, E10:F10)","v":"java.util.LinkedHashMap@Mon, 3 Dec 2018 14:05:25:827..6594279504195519501"},null,null,null," ","Histogram output object",null,{"$f":"_xll.AC.stats.sample.calc.get(calc!K10, \"\")","v":"java.util.ArrayList@Mon, 3 Dec 2018 14:23:36:629..5817613651396862894"},null,null,null,{"$f":"_xll.AC.data.size(K11, 1)","v":40}," "]
[null,"Distribution object","D",{"$f":"_xll.AC.stats.distrib.fn(D10, D11)","v":"jmathkr.lib.stats.distribution.R1.standard.apache.DistributionNormalR1Apache@Mon, 3 Dec 2018 14:23:36:629..8386079392809813382"},null,null,null," ","Histogram domain",null,{"$f":"_xll.AC.data.list_x(OFFSET(test!H11, 0, 0, O11, 1), 1, 1)","v":"java.util.ArrayList@Mon, 3 Dec 2018 14:23:36:629..311239986441632745"},null,null,null,{"$f":"_xll.AC.data.size(K12, 1)","v":40}," "]
[null,null,null,null,null,null,null,null,"Sample pdf values","pdf(x)",{"$f":"_xll.AC.stats.distrib.pdf(D12, K12, 1)","v":"java.util.ArrayList@Mon, 3 Dec 2018 14:23:36:629..483255320158721075"},null,null,null,{"$f":"_xll.AC.data.size(K13, 1)","v":40}," "]
[null,"Matched distribution based on historical sample",null,null,null,null,null," ",{"$f":"B14","v":"Matched distribution based on historical sample"},null,null,null,null,null,null," "]
[null,{"$f":"B9","v":"Distribution index"},null,10,{"$f":"IF(OFFSET(config!E7, $D$15,0)=\"\", \"\", OFFSET(config!E7, $D$15,0))","v":"mean"},{"$f":"IF(OFFSET(config!F7, $D$15,0)=\"\", \"\", OFFSET(config!F7, $D$15,0))","v":"stdev"},{"$f":"IF(OFFSET(config!G7, $D$15,0)=\"\", \"\", OFFSET(config!G7, $D$15,0))","v":""}," ",{"$f":"I9","v":"Histogram parameters"},null,{"$f":"_xll.AC.data.map(test!C32:C34, test!E32:E34)","v":"java.util.LinkedHashMap@Mon, 3 Dec 2018 14:12:30:350..8127087316467667413"},null,null,null,{"$f":"_xll.AC.data.size(K15, 1)","v":3}," "]
[null,{"$f":"B10","v":"Distribution"},null,{"$f":"D10","v":"Normal"},{"$f":"IF(OFFSET(test!V12, $D$15,0)=\"\", \"\", OFFSET(test!V12, $D$15,0))","v":0.45746052873075166},{"$f":"IF(OFFSET(test!W12, $D$15,0)=\"\", \"\", OFFSET(test!W12, $D$15,0))","v":0.14596581623061439},{"$f":"IF(OFFSET(test!X12, $D$15,0)=\"\", \"\", OFFSET(test!X12, $D$15,0))","v":""}," ",{"$f":"I10","v":"Histogram object"},{"$f":"J10","v":"H(x)"},{"$f":"_xll.AC.stats.sample.calc.hist(D32, K15)","v":"jmathkr.lib.stats.basic.calc.Histogram@Mon, 3 Dec 2018 14:23:36:629..8837194665079754400"},null,null,null," "," "]
[null,{"$f":"B11","v":"Distribution object parameters"},null,{"$f":"_xll.AC.stats.distrib.get(D18, config!N25)","v":"java.util.ArrayList@Mon, 3 Dec 2018 14:05:23:210..7990039091190993303"},null,null,null," ",{"$f":"I11","v":"Histogram output object"},null,{"$f":"_xll.AC.stats.sample.calc.get(calc!K16, \"\")","v":"java.util.ArrayList@Mon, 3 Dec 2018 14:12:30:350..4966281083386062117"},null,null,null,{"$f":"_xll.AC.data.size(K17, 1)","v":40}," "]
[null,{"$f":"B12","v":"Distribution object"},null,{"$f":"_xll.AC.stats.distrib.fn(D16, D31)","v":"jmathkr.lib.stats.distribution.R1.standard.apache.DistributionNormalR1Apache@Mon, 3 Dec 2018 14:21:13:693..5945545458206773632"},null,null,null," ",{"$f":"I12","v":"Histogram domain"},null,{"$f":"_xll.AC.data.list_x(OFFSET(test!M11,0, 0, O11, 1), 1, 1)","v":"java.util.ArrayList@Mon, 3 Dec 2018 14:14:04:085..2772695393865934484"},null,null,null,{"$f":"_xll.AC.data.size(K18, 1)","v":40}," "]
[null,null,null,null,null,null,null,null,{"$f":"I13","v":"Sample pdf values"},{"$f":"J13","v":"pdf(x)"},{"$f":"_xll.AC.stats.distrib.pdf(D18, K18, 1)","v":"java.util.ArrayList@Mon, 3 Dec 2018 14:14:04:085..6841351965175992875"},null,null,null,{"$f":"_xll.AC.data.size(K19, 1)","v":40}," "]
[null,null,null,null,null,null,null," ",null,null,null,null,null,null,null," "]
{"$rows_left_out":16}
{"sheet":"config","index":4,"n_rows":41,"n_cols":22,"rows_kept":41,"cut":false,"hidden":false,"merged":[[2,18,3,21],[14,19,14,21],[11,18,12,21],[5,4,5,6],[5,9,5,11],[5,12,5,14],[5,19,5,21],[5,15,5,16]]}
[]
[null,"TAB: CONFIGURATION FILE",null,null,null,"Calculation enabled",null,false]
[null,null,null,null,null,null,null,null,null,null,null,null,null,null,null,null,null,null,{"$f":"calc!B8","v":"Matched or alternative distribution based on generated sampe"}]
[null,"Standard distributions"]
[]
[null,"#","Distribution name","Notation","Parameters",null,null,"Default values",null,"Parameter values",null,null,"Statistics",null,null,"Distribution support",null,null,"Name","Parameters"]
[null,null,null,null,"p1","p2","p3",null,null,"v1","v2","v3","mean","stdev","mode","min","max",null,null,"p1","p2","p3"]
[null,1,"Beta","Beta","alpha","beta",null,null,null,{"$f":"IF($S$8=$C8, IF(T$9=\"\", \"\", T$9), IF($S$17=$C8, IF(T$18=\"\", \"\", T$18), \"\"))","v":""},{"$f":"IF($S$8=$C8, IF(U$9=\"\", \"\", U$9), IF($S$17=$C8, IF(U$18=\"\", \"\", U$18), \"\"))","v":""},{"$f":"IF($S$8=$C8, IF(V$9=\"\", \"\", V$9), IF($S$17=$C8, IF(V$18=\"\", \"\", V$18), \"\"))","v":""},{"$f":"IF(OR($S$8=C8, $S$17=C8), J8/(J8+K8), \"\")","v":""},null,{"$f":"IF(OR($S$8=C8, $S$17=C8), (J8-1)/(J8+K8-2), \"\")","v":""},0,1,null,{"$f":"calc!D10","v":"Normal"},{"$f":"IF(calc!E9=\"\", \"\", calc!E9)","v":"mean"},{"$f":"IF(calc!F9=\"\", \"\", calc!F9)","v":"stdev"},{"$f":"IF(calc!G9=\"\", \"\", calc!G9)","v":""}]
[null,{"$f":"B8+1","v":2},"Chi-squred ","Chi2","mu",null,null,null,null,"","","",{"$f":"IF(OR($S$8=C9, $S$17=C9), J9, \"\")","v":""},null,null,0,{"$f":"IF(M9=\"\", \"\", M9+$Q$22*N9)","v":""},null,null,{"$f":"IF(calc!E10=\"\", \"\", calc!E10)","v":0.45746052873075166},{"$f":"IF(calc!F10=\"\", \"\", calc!F10)","v":0.14596581623061439},{"$f":"IF(calc!G10=\"\", \"\", calc!G10)","v":""}]
[null,{"$f":"B9+1","v":3},"Exponential","Exponential","mu",null,null,null,null,"","","",{"$f":"IF(OR($S$8=C10, $S$17=C10), 1/J9, \"\")","v":""},null,null,0,""]
[null,4,"Fisher","F","df1","df2",null,null,null,"","","",{"$f":"IF(OR($S$8=C11, $S$17=C11), J11/(J11-2), \"\")","v":""},null,{"$f":"IF(OR($S$8=C11, $S$17=C11), J11*(K11-2)/((J11+2)*K11), \"\")","v":""},0,""]
[null,5,"Gamma","Gamma","alpha","beta",null,null,null,"","","",{"$f":"IF(OR($S$8=C12, $S$17=C12), J12/K12, \"\")","v":""},{"$f":"IF(OR($S$8=C12, $S$17=C12), SQRT(J12/(K12*K12)), \"\")","v":""},null,0,"",null,{"$f":"calc!B14","v":"Matched distribution based on historical sample"}]
[null,6,"Geometric","Geometric","mu",null,null,null,null,"","","",{"$f":"IF(OR($S$8=C13, $S$17=C13), 1/J13, \"\")","v":""},null,null,0,""]
[null,7,"Laplace","Laplace","mu","b",null,null,null,"","","",{"$f":"IF(OR($S$8=C14, $S$17=C14), J14, \"\")","v":""},{"$f":"IF(OR($S$8=C14, $S$17=C14), SQRT(2*K14*K14), \"\")","v":""},null,{"$f":"IF(M14=\"\", \"\", M14-$Q$22*N14)","v":""},""]
[null,8,"Logistic","Logistic","mu","s",null,null,null,"","","",{"$f":"IF(OR($S$8=C15, $S$17=C15), J15, \"\")","v":""},{"$f":"IF(OR($S$8=C15, $S$17=C15), SQRT(K15*K15*PI()*PI()/3), \"\")","v":""},null,{"$f":"IF(M15=\"\", \"\", M15-$Q$22*N15)","v":""},"",null,"Name","Parameters"]
[null,9,"Log-Normal","Log-Normal","mean","stdev",null,"μ = 0; σ = 1",null,"","","",{"$f":"IF(OR($S$8=C16, $S$17=C16), EXP(J16+K16*K16/2), \"\")","v":""},{"$f":"IF(OR($S$8=C16, $S$17=C16), SQRT((EXP(K16*K16)-1)*EXP(2*J16+K16*K16)), \"\")","v":""},null,{"$f":"IF(M16=\"\", \"\", M16-$Q$22*N16)","v":""},"",null,null,"p1","p2","p3"]
[null,10,"Normal","Normal","mean","stdev",null,"μ = 0; σ = 1",null,0.45746052873075166,0.14596581623061439,"",{"$f":"IF(OR($S$8=C17, $S$17=C17), J17, \"\")","v":0.45746052873075166},{"$f":"IF(OR($S$8=C17, $S$17=C17), K17, \"\")","v":0.14596581623061439},null,{"$f":"IF(M17=\"\", \"\", M17-$Q$22*N17)","v":1.9563080038908498E-2},0.89535797742259482,null,{"$f":"calc!D16","v":"Normal"},{"$f":"IF(calc!E15=\"\", \"\", calc!E15)","v":"mean"},{"$f":"IF(calc!F15=\"\", \"\", calc!F15)","v":"stdev"},{"$f":"IF(calc!G15=\"\", \"\", calc!G15)","v":""}]
[null,11,"Poisson","Poisson","lambda","scale",null,null,null,"","","",{"$f":"IF(OR($S$8=C18, $S$17=C18), J18/K18, \"\")","v":""},{"$f":"IF(OR($S$8=C18, $S$17=C18), SQRT(J18)/K18, \"\")","v":""},null,0,"",null,null,{"$f":"_xll.AC.data._get(calc!D17, \"X\", 1)","v":0.45746052873075166},0.14596581623061439,{"$f":"IF(calc!G16=\"\", \"\", calc!G16)","v":""}]
[null,12,"Student T","T","nu",null,null,null,null,"","","",null,{"$f":"IF(OR($S$8=C19, $S$17=C19), IF(J19>2, SQRT(J19/(J19-2)), \"\"), \"\")","v":""},null,{"$f":"IF(M19=\"\", \"\", M19-$Q$22*N19)","v":""},""]
[null,13,"Triangular","Triangular","a","b","c",null,null,"","","",{"$f":"IF(OR($S$8=C20, $S$17=C20), (J20+K20+L20)/3, \"\")","v":""},null,null,{"$f":"IF(J20=\"\", \"\", J20)","v":""},{"$f":"IF(K20=\"\", \"\", K20)","v":""}]
{"$rows_left_out":22}
{"sheet":"guide","index":5,"n_rows":2,"n_cols":2,"rows_kept":2,"cut":false,"hidden":false,"merged":[[1,1,32,8]]}
[]
[null,"Package: AC.stats.distrib\n\nAvailable functions:\n\n1.     \n"]