{"text_format":"1","workbook":"xlsx","n_sheets":5,"sheets":["guide","data","calc","charts","config"],"not_rendered":{"charts":3,"images":0,"macros":1,"external_links":0,"defined_names":9,"comments":0,"pivot_tables":0},"unopened":[],"bounds":{"document_bytes":16777216,"sheet_cells":100000,"rows_first":2000,"rows_last":500,"rows_between":2000,"halvings":0,"cell_chars":16384,"cell_head_chars":4096},"cells_cut":0,"cells_raw":0,"read":"whole","date_system":"1900"}

{"sheet":"guide","index":0,"n_rows":2,"n_cols":2,"rows_kept":2,"cut":false,"hidden":false,"merged":[[1,1,32,8]]}
[]
[null,"Package: AC.stats.samplecalc\n\n"]

{"sheet":"data","index":1,"n_rows":106,"n_cols":23,"rows_kept":106,"cut":false,"hidden":false,"merged":[]}
[]
[null,"TAB: DATA (IN %)",null,null,null,null,null,null,null,null,"ORTHOGONALIZED DATA"]
[]
[null,"Treasury yield data",null,null,null,null,"Normalized Data",null,null,null,"PC (O) = V x X*",null,null,null,null,"F = V x X"]
[null,"mean",{"$f":"AVERAGE(C9:C106)","v":2.7834704081632649},{"$f":"AVERAGE(D9:D106)","v":4.0751826530612263},4.8671673469387775,null,{"$f":"AVERAGE(G9:G106)","v":3.7838213288245131E-16},-9.2896212264553914E-16,-9.8787191578891481E-16,null,null,{"$f":"VAR(L9:L106)","v":2.7996448715655862},{"$f":"VAR(M9:M106)","v":0.19722034865014168},{"$f":"VAR(N9:N106)","v":3.1347797842785838E-3},null,null,null,null,null,null,"n",{"$f":"calc!L11","v":98}]
[null,"stdev",{"$f":"STDEV(C9:C106)","v":2.2063863899822267},{"$f":"STDEV(D9:D106)","v":1.9599215825900154},1.6844214267951152,null,{"$f":"STDEV(G9:G106)","v":0.99999999999999978},1.0000000000000022,1.0000000000000009,null,null,{"$f":"AVERAGE(L9:L106)","v":-1.2552317462088504E-15},{"$f":"AVERAGE(M9:M106)","v":-9.9580208025052304E-16},{"$f":"AVERAGE(N9:N106)","v":-1.0988942182514304E-16},null,null,null,null,null,null,"Correlation of X1 with data"]
[null,"Date","3M","5Y","10Y",null,"3M*","5Y*","10Y*",null,"Data","PC1","PC2","PC3",null,"F1=Index","F2","F3",null,null,{"$f":"data!G7","v":"3M*"},{"$f":"data!H7","v":"5Y*"},{"$f":"data!I7","v":"10Y*"}]
[]
[null,"2015-09-30",0.14829999999999999,1.3698000000000001,2.3169,null,{"$f":"(C9 - C$5)/C$6","v":-1.1943376827050189},{"$f":"(D9 - D$5)/D$6","v":-1.3803524983311282},-1.514031646932368,null,{"$f":"data!B9","v":"2015-09-30"},{"$f":"_xll.AC.data._get(calc!D13, \"X\", 1)","v":-2.3630782789864351},-0.18541911771883945,7.4753903294719981E-2,null,{"$f":"SUMPRODUCT(calc!$D$29:$F$29, data!C9:E9)/calc!$G$29","v":1.290477391383819},{"$f":"SUMPRODUCT(calc!$D$30:$F$30, data!C9:E9)","v":1.4819083801584272},{"$f":"SUMPRODUCT(calc!$D$31:$F$31, data!C9:E9)","v":-0.27841133839856758},null,"correlation",{"$f":"SUMPRODUCT($L$9:$L$106, data!G$9:G$106) / ($V$5*SQRT($L$5)*data!C$6)","v":0.42001009893344299},{"$f":"SUMPRODUCT($L$9:$L$106, data!H$9:H$106) / ($V$5*SQRT($L$5)*data!D$6)","v":0.50301699850407522},{"$f":"SUMPRODUCT($L$9:$L$106, data!I$9:I$106) / ($V$5*SQRT($L$5)*data!E$6)","v":0.56697490193492783}]
[null,"2015-06-30",0.12620000000000001,1.5897999999999999,2.6962000000000002,null,{"$f":"(C10 - C$5)/C$6","v":-1.2043540606614558},{"$f":"(D10 - D$5)/D$6","v":-1.2681031093993158},{"$f":"(E10 - E$5)/E$6","v":-1.2888504696056939},null,{"$f":"data!B10","v":"2015-06-30"},-2.1720104737080046,-2.5717225969049906E-2,3.7401322088317701E-2,null,{"$f":"SUMPRODUCT(calc!$D$29:$F$29, data!C10:E10)/calc!$G$29","v":1.4852926840981235},{"$f":"SUMPRODUCT(calc!$D$30:$F$30, data!C10:E10)","v":1.7604314155480731},{"$f":"SUMPRODUCT(calc!$D$31:$F$31, data!C10:E10)","v":-0.3157681983447842},null,"beta",{"$f":"SUMPRODUCT($L$9:$L$106, data!G$9:G$106)/$V$5","v":1.5505749931646733},{"$f":"SUMPRODUCT($L$9:$L$106, data!H$9:H$106)/$V$5","v":1.6495779002010607},{"$f":"SUMPRODUCT($L$9:$L$106, data!I$9:I$106)/$V$5","v":1.5979605913879342}]
[null,"2015-03-31",0.12039999999999999,1.3105,2.2896999999999998,null,-1.2069827933378057,-1.4106088108932029,-1.5301796248477004,null,{"$f":"data!B11","v":"2015-03-31"},-2.3974768781303939,-0.19017539602597011,6.3342739588866492E-2,null,{"$f":"SUMPRODUCT(calc!$D$29:$F$29, data!C11:E11)/calc!$G$29","v":1.2520152873791148},{"$f":"SUMPRODUCT(calc!$D$30:$F$30, data!C11:E11)","v":1.4776624913500456},{"$f":"SUMPRODUCT(calc!$D$31:$F$31, data!C11:E11)","v":-0.30252660802397691}]
[null,"2014-12-31",0.1113,1.5497000000000001,2.5749,null,-1.2111071842610444,-1.2885631116546143,-1.3608633270001722,null,{"$f":"data!B12","v":"2014-12-31"},-2.2294954503037321,-6.6231622194036333E-2,6.3936754345379487E-2,null,{"$f":"SUMPRODUCT(calc!$D$29:$F$29, data!C12:E12)/calc!$G$29","v":1.4262936083507298},{"$f":"SUMPRODUCT(calc!$D$30:$F$30, data!C12:E12)","v":1.6939927971457092},{"$f":"SUMPRODUCT(calc!$D$31:$F$31, data!C12:E12)","v":-0.27461463321758695}]
[null,"2014-09-30",2.9000000000000001E-2,1.6954,2.8970000000000002,null,-1.2484079944789059,-1.2142234027120455,-1.169640397348388,null,{"$f":"data!B13","v":"2014-09-30"},-2.0958441175323861,8.8493846346157645E-2,2.2933068820216063E-2,null,{"$f":"SUMPRODUCT(calc!$D$29:$F$29, data!C13:E13)/calc!$G$29","v":1.5570604788304736},{"$f":"SUMPRODUCT(calc!$D$30:$F$30, data!C13:E13)","v":1.9735719680147705},{"$f":"SUMPRODUCT(calc!$D$31:$F$31, data!C13:E13)","v":-0.32276558769621766},null,"Index is a normalized weighted-average of data,"]
[null,"2014-06-30",5.2600000000000001E-2,1.5710999999999999,2.8462000000000001,null,-1.2377117718647925,-1.2776443074585198,-1.1997991208079057,null,{"$f":"data!B14","v":"2014-06-30"},-2.1450036594242459,5.1284408306721874E-2,-1.2351008318793544E-2,null,{"$f":"SUMPRODUCT(calc!$D$29:$F$29, data!C14:E14)/calc!$G$29","v":1.5050347478860067},{"$f":"SUMPRODUCT(calc!$D$30:$F$30, data!C14:E14)","v":1.9034398734959272},{"$f":"SUMPRODUCT(calc!$D$31:$F$31, data!C14:E14)","v":-0.39729568080340028},null,"where weighted average is based on first eigen-vector"]
[null,"2014-03-31",4.7600000000000003E-2,1.6953,3.0716999999999999,null,-1.2399779207237147,-1.2142744251615603,-1.0659252597818976,null,{"$f":"data!B15","v":"2014-03-31"},-2.0313493401203675,0.14272816598797433,-3.811577037274283E-2,null,{"$f":"SUMPRODUCT(calc!$D$29:$F$29, data!C15:E15)/calc!$G$29","v":1.6212189138855209},{"$f":"SUMPRODUCT(calc!$D$30:$F$30, data!C15:E15)","v":2.0614448234709291},{"$f":"SUMPRODUCT(calc!$D$31:$F$31, data!C15:E15)","v":-0.42670495944938813}]
[null,"2013-12-31",6.5500000000000003E-2,1.7927999999999999,3.2871999999999999,null,-1.2318651078087728,-1.1645275368849617,-0.93798815534240831,null,{"$f":"data!B16","v":"2013-12-31"},-1.9234204243230388,0.22010924040864011,-7.3780764067886029E-2,null,{"$f":"SUMPRODUCT(calc!$D$29:$F$29, data!C16:E16)/calc!$G$29","v":1.7322937450217235},{"$f":"SUMPRODUCT(calc!$D$30:$F$30, data!C16:E16)","v":2.1908264973396774},{"$f":"SUMPRODUCT(calc!$D$31:$F$31, data!C16:E16)","v":-0.47708426837024986}]
[null,"2013-09-30",2.8500000000000001E-2,1.4678,2.7785000000000002,null,-1.248634609364798,-1.3303504978069571,-1.2399909628986407,null,{"$f":"data!B17","v":"2013-09-30"},-2.2056676616122828,2.7137651365618964E-2,-2.8144931786412641E-2,null,{"$f":"SUMPRODUCT(calc!$D$29:$F$29, data!C17:E17)/calc!$G$29","v":1.439185495368958},{"$f":"SUMPRODUCT(calc!$D$30:$F$30, data!C17:E17)","v":1.8647446358233135},{"$f":"SUMPRODUCT(calc!$D$31:$F$31, data!C17:E17)","v":-0.43386894476364124}]
[null,"2013-06-30",7.1999999999999995E-2,1.4295,2.6775000000000002,null,-1.2289191142921738,-1.3498920959709955,-1.2999522044224849,null,{"$f":"data!B18","v":"2013-06-30"},-2.2408455846530626,-2.7061657244016324E-2,-1.432921730547998E-2,null,{"$f":"SUMPRODUCT(calc!$D$29:$F$29, data!C18:E18)/calc!$G$29","v":1.4064386998618308},{"$f":"SUMPRODUCT(calc!$D$30:$F$30, data!C18:E18)","v":1.7643782846835991},{"$f":"SUMPRODUCT(calc!$D$31:$F$31, data!C18:E18)","v":-0.4173846448435985}]
[null,"2013-03-31",6.5100000000000005E-2,0.84289999999999998,1.8218999999999999,null,-1.2320463997174866,-1.649189784822819,-1.8079010979650694,null,{"$f":"data!B19","v":"2013-03-31"},-2.7136748226876817,-0.37500146692510039,4.0181014908323154E-2,null,{"$f":"SUMPRODUCT(calc!$D$29:$F$29, data!C19:E19)/calc!$G$29","v":0.91758897732911848},{"$f":"SUMPRODUCT(calc!$D$30:$F$30, data!C19:E19)","v":1.1652326323089961},{"$f":"SUMPRODUCT(calc!$D$31:$F$31, data!C19:E19)","v":-0.389840235743943}]
[null,"2012-12-31",8.8700000000000001E-2,0.80200000000000005,1.7439,null,-1.2213501771033732,-1.6700579666742332,-1.8542077993399193,null,{"$f":"data!B20","v":"2012-12-31"},-2.7468152507575754,-0.41428384907045523,4.7447875615975077E-2,null,{"$f":"SUMPRODUCT(calc!$D$29:$F$29, data!C20:E20)/calc!$G$29","v":0.88517726116151318},{"$f":"SUMPRODUCT(calc!$D$30:$F$30, data!C20:E20)","v":1.0936502726395396},{"$f":"SUMPRODUCT(calc!$D$31:$F$31, data!C20:E20)","v":-0.38350064950410767}]
[null,"2012-09-30",0.1162,0.70009999999999994,1.6006,null,-1.2088863583793004,-1.7220498427294681,-1.9392815212247396,null,{"$f":"data!B21","v":"2012-09-30"},-2.8198493144653574,-0.48314914102837903,5.1879264804788994E-2,null,{"$f":"SUMPRODUCT(calc!$D$29:$F$29, data!C21:E21)/calc!$G$29","v":0.81130678486064944},{"$f":"SUMPRODUCT(calc!$D$30:$F$30, data!C21:E21)","v":0.97001539277215998},{"$f":"SUMPRODUCT(calc!$D$31:$F$31, data!C21:E21)","v":-0.38889314447651624}]
[null,"2012-06-30",0.1113,0.79879999999999995,1.6753,null,-1.2111071842610444,-1.6716906850586959,-1.8949339495234412,null,{"$f":"data!B22","v":"2012-06-30"},-2.7655406594668985,-0.44658120534005441,6.6746679390434771E-2,null,{"$f":"SUMPRODUCT(calc!$D$29:$F$29, data!C22:E22)/calc!$G$29","v":0.86853410520905772},{"$f":"SUMPRODUCT(calc!$D$30:$F$30, data!C22:E22)","v":1.0349434494283818},{"$f":"SUMPRODUCT(calc!$D$31:$F$31, data!C22:E22)","v":-0.35267832545612876}]
[null,"2012-03-31",0.1106,1.1560999999999999,2.2528999999999999,null,-1.2114244451012934,-1.4893874729435297,-1.5520268890860911,null,{"$f":"data!B23","v":"2012-03-31"},-2.4594562880218076,-0.21321251059255009,1.5062796325767014E-2,null,{"$f":"SUMPRODUCT(calc!$D$29:$F$29, data!C23:E23)/calc!$G$29","v":1.1835101522814175},{"$f":"SUMPRODUCT(calc!$D$30:$F$30, data!C23:E23)","v":1.4369114857096132},{"$f":"SUMPRODUCT(calc!$D$31:$F$31, data!C23:E23)","v":-0.400297389865648}]
[null,"2011-12-31",1.6E-2,0.92479999999999996,1.9491000000000001,null,-1.2542999815121041,-1.6074023986704762,-1.732385554184545,null,{"$f":"data!B24","v":"2011-12-31"},-2.6577050461252427,-0.30578785770242034,3.5613159117710125E-2,null,{"$f":"SUMPRODUCT(calc!$D$29:$F$29, data!C24:E24)/calc!$G$29","v":0.97224124554242231},{"$f":"SUMPRODUCT(calc!$D$30:$F$30, data!C24:E24)","v":1.2930038080329536},{"$f":"SUMPRODUCT(calc!$D$31:$F$31, data!C24:E24)","v":-0.38560966923836237}]
[null,"2011-09-30",2.4899999999999999E-2,0.99819999999999998,2.0318000000000001,null,-1.2502662365432222,-1.5699519207268624,-1.6832885772140309,null,{"$f":"data!B25","v":"2011-09-30"},-2.6048421571937284,-0.27362263261414277,3.6098765086669204E-2,null,{"$f":"SUMPRODUCT(calc!$D$29:$F$29, data!C25:E25)/calc!$G$29","v":1.0278944678078425},{"$f":"SUMPRODUCT(calc!$D$30:$F$30, data!C25:E25)","v":1.3473159963886583},{"$f":"SUMPRODUCT(calc!$D$31:$F$31, data!C25:E25)","v":-0.37722297866541521}]
[null,"2011-06-30",3.8800000000000001E-2,1.8576000000000001,3.3178000000000001,null,-1.2439663427154182,-1.1314649895995912,-0.91982168018765942,null,{"$f":"data!B26","v":"2011-06-30"},-1.9000343239316559,0.24610033306375156,-5.5148905602106169E-2,null,{"$f":"SUMPRODUCT(calc!$D$29:$F$29, data!C26:E26)/calc!$G$29","v":1.7561343419720636},{"$f":"SUMPRODUCT(calc!$D$30:$F$30, data!C26:E26)","v":2.2411854341307893},{"$f":"SUMPRODUCT(calc!$D$31:$F$31, data!C26:E26)","v":-0.43698147298225609}]
[null,"2011-03-31",7.4999999999999997E-2,2.2625999999999999,3.7355999999999998,null,-1.2275594249768202,-0.92482406906602754,-0.67178399000288658,null,{"$f":"data!B27","v":"2011-03-31"},-1.6248110486954439,0.41477536327077658,-3.8024779529560016E-2,null,{"$f":"SUMPRODUCT(calc!$D$29:$F$29, data!C27:E27)/calc!$G$29","v":2.0462145586735918},{"$f":"SUMPRODUCT(calc!$D$30:$F$30, data!C27:E27)","v":2.5284494709476277},{"$f":"SUMPRODUCT(calc!$D$31:$F$31, data!C27:E27)","v":-0.36561434984834817}]
[null,"2010-12-31",0.1391,2.0516000000000001,3.5558999999999998,null,-1.198507396605436,-1.0324814375415385,-0.77846750586263702,null,{"$f":"data!B28","v":"2010-12-31"},-1.7341612810898108,0.31041416409017603,-6.9117683489245574E-2,null,{"$f":"SUMPRODUCT(calc!$D$29:$F$29, data!C28:E28)/calc!$G$29","v":1.9345409603196571},{"$f":"SUMPRODUCT(calc!$D$30:$F$30, data!C28:E28)","v":2.335509903898962},{"$f":"SUMPRODUCT(calc!$D$31:$F$31, data!C28:E28)","v":-0.44503184109933414}]
[null,"2010-09-30",0.13819999999999999,1.4104999999999999,2.6593,null,-1.1989153034000422,-1.3595863613787429,-1.3107571014099499,null,{"$f":"data!B29","v":"2010-09-30"},-2.2360583077227809,-5.8811515029375094E-2,-2.3272469452136346E-2,null,{"$f":"SUMPRODUCT(calc!$D$29:$F$29, data!C29:E29)/calc!$G$29","v":1.4152386588070676},{"$f":"SUMPRODUCT(calc!$D$30:$F$30, data!C29:E29)","v":1.6980538554420042},{"$f":"SUMPRODUCT(calc!$D$31:$F$31, data!C29:E29)","v":-0.43844599838648413}]
[null,"2010-06-30",0.20319999999999999,1.8797000000000001,3.2566000000000002,null,-1.1694553682340518,-1.1201890282568956,-0.95615463049715699,null,{"$f":"data!B30","v":"2010-06-30"},-1.8725804474116283,0.16783003491556292,-4.4232816908167383E-2,null,{"$f":"SUMPRODUCT(calc!$D$29:$F$29, data!C30:E30)/calc!$G$29","v":1.7964783256841772},{"$f":"SUMPRODUCT(calc!$D$30:$F$30, data!C30:E30)","v":2.079143895521113},{"$f":"SUMPRODUCT(calc!$D$31:$F$31, data!C30:E30)","v":-0.42584787712414474}]
[null,"2010-03-31",0.15079999999999999,2.6278000000000001,4.1577000000000002,null,-1.1932046082755579,-0.73849008343921874,-0.4211934944859102,null,{"$f":"data!B31","v":"2010-03-31"},-1.350161205873786,0.56722641741550883,-4.2751723763555266E-2,null,{"$f":"SUMPRODUCT(calc!$D$29:$F$29, data!C31:E31)/calc!$G$29","v":2.3368409900181493},{"$f":"SUMPRODUCT(calc!$D$30:$F$30, data!C31:E31)","v":2.7800061926500703},{"$f":"SUMPRODUCT(calc!$D$31:$F$31, data!C31:E31)","v":-0.3377763338451607}]
[null,"2009-12-31",5.0500000000000003E-2,2.7233000000000001,4.1844999999999999,null,-1.23866355438554,-0.68976364415290936,-0.40528298683403885,null,{"$f":"data!B32","v":"2009-12-31"},-1.3374170938500578,0.6209879910578795,-2.2399140173152421E-3,null,{"$f":"SUMPRODUCT(calc!$D$29:$F$29, data!C32:E32)/calc!$G$29","v":2.3461857797248649},{"$f":"SUMPRODUCT(calc!$D$30:$F$30, data!C32:E32)","v":2.8916567799396966},{"$f":"SUMPRODUCT(calc!$D$31:$F$31, data!C32:E32)","v":-0.25309505862495874}]
[null,"2009-09-30",0.1265,2.3647999999999998,3.7702999999999998,null,-1.2042180917299203,-0.87267912566224926,-0.65118344464766498,null,{"$f":"data!B33","v":"2009-09-30"},-1.5688297498041972,0.41750317005023885,-1.4637845701427898E-2,null,{"$f":"SUMPRODUCT(calc!$D$29:$F$29, data!C33:E33)/calc!$G$29","v":2.1095500147930277},{"$f":"SUMPRODUCT(calc!$D$30:$F$30, data!C33:E33)","v":2.5259155227902768},{"$f":"SUMPRODUCT(calc!$D$31:$F$31, data!C33:E33)","v":-0.31798763279872677}]
[null,"2009-06-30",0.2298,2.609,4.0635000000000003,null,-1.1573994563045849,-0.7480823039479374,-0.47711774153092112,null,{"$f":"data!B34","v":"2009-06-30"},-1.3680853860307616,0.5044122892969366,-2.7433431302983202E-2,null,{"$f":"SUMPRODUCT(calc!$D$29:$F$29, data!C34:E34)/calc!$G$29","v":2.3245352102653087},{"$f":"SUMPRODUCT(calc!$D$30:$F$30, data!C34:E34)","v":2.6589677729902164},{"$f":"SUMPRODUCT(calc!$D$31:$F$31, data!C34:E34)","v":-0.31870346209236611}]
[null,"2009-03-31",0.22520000000000001,1.8369,3.0564,null,-1.1594843132547934,-1.1420266366490845,-1.0750084973592717,null,{"$f":"data!B35","v":"2009-03-31"},-1.9485385525093704,8.6348689883723684E-2,3.6597861483593785E-3,null,{"$f":"SUMPRODUCT(calc!$D$29:$F$29, data!C35:E35)/calc!$G$29","v":1.7221989248723089},{"$f":"SUMPRODUCT(calc!$D$30:$F$30, data!C35:E35)","v":1.9367333862342913},{"$f":"SUMPRODUCT(calc!$D$31:$F$31, data!C35:E35)","v":-0.35119260883924275}]
[null,"2008-12-31",0.1208,1.6291,2.8717000000000001,null,-1.2068015014290918,-1.2480512867401328,-1.1846603915122818,null,{"$f":"data!B36","v":"2008-12-31"},-2.1013615032331261,4.0894780209692061E-2,-5.4379301817756298E-3,null,{"$f":"SUMPRODUCT(calc!$D$29:$F$29, data!C36:E36)/calc!$G$29","v":1.5555072364162188},{"$f":"SUMPRODUCT(calc!$D$30:$F$30, data!C36:E36)","v":1.874605867105803},{"$f":"SUMPRODUCT(calc!$D$31:$F$31, data!C36:E36)","v":-0.38327589927130767}]
[null,"2008-09-30",0.87280000000000002,3.0617000000000001,4.1990999999999996,null,-0.86597271304717216,-0.51710367499597598,-0.39661532221772094,null,{"$f":"data!B37","v":"2008-09-30"},-1.0210954133294323,0.3615504050396614,3.5413637877845155E-2,null,{"$f":"SUMPRODUCT(calc!$D$29:$F$29, data!C37:E37)/calc!$G$29","v":2.7331264406410858},{"$f":"SUMPRODUCT(calc!$D$30:$F$30, data!C37:E37)","v":2.3091700799585557},{"$f":"SUMPRODUCT(calc!$D$31:$F$31, data!C37:E37)","v":-0.20082775180993062}]
[null,"2008-06-30",1.7748999999999999,3.3837999999999999,4.274,null,-0.45711413592040395,-0.35276036510989978,-0.35214901538469179,null,{"$f":"data!B38","v":"2008-06-30"},-0.66884307248245378,9.3098521507182258E-2,3.7198752298203158E-2,null,{"$f":"SUMPRODUCT(calc!$D$29:$F$29, data!C38:E38)/calc!$G$29","v":3.1603339249569351},{"$f":"SUMPRODUCT(calc!$D$30:$F$30, data!C38:E38)","v":1.6961781444659039},{"$f":"SUMPRODUCT(calc!$D$31:$F$31, data!C38:E38)","v":-0.21547909521294617}]
[null,"2008-03-31",1.2376,2.5417000000000001,3.665,null,-0.70063449230019836,-0.782420412471169,-0.7136974915037122,null,{"$f":"data!B39","v":"2008-03-31"},-1.2693657105336529,-1.5493116257259687E-3,-3.3805259736961246E-2,null,{"$f":"SUMPRODUCT(calc!$D$29:$F$29, data!C39:E39)/calc!$G$29","v":2.4943656222280572},{"$f":"SUMPRODUCT(calc!$D$30:$F$30, data!C39:E39)","v":1.616612137519186},{"$f":"SUMPRODUCT(calc!$D$31:$F$31, data!C39:E39)","v":-0.39626156586883621}]
[null,"2007-12-31",3.2477,3.4927999999999999,4.2887000000000004,null,0.21040267196376003,-0.29714589513913814,-0.34342198320250827,null,{"$f":"data!B40","v":"2007-12-31"},-0.25719060073769989,-0.41973165040819982,-9.0454200853597677E-2,null,{"$f":"SUMPRODUCT(calc!$D$29:$F$29, data!C40:E40)/calc!$G$29","v":3.6786586518836324},{"$f":"SUMPRODUCT(calc!$D$30:$F$30, data!C40:E40)","v":0.55961470135799041},{"$f":"SUMPRODUCT(calc!$D$31:$F$31, data!C40:E40)","v":-0.50529560085366354}]
{"$rows_left_out":67}
{"sheet":"calc","index":2,"n_rows":174,"n_cols":17,"rows_kept":174,"cut":false,"hidden":false,"merged":[]}
[]
[null,"TAB: PCA CALCULATOR"]
[]
[null,"A. Inputs and  Calculator:",null,null,null,null,null," "]
[]
[null,"Abbreviation","Dim","Calculator object",null,null,null,"Description",null,"Parameter","Date","Row index"]
[null,"X","3 x n",{"$f":"_xll.AC.data.list_xx(OFFSET(data!$G$8, L7, 0, L11, L10), 1)","v":"java.util.ArrayList@Tue, 23 Jan 2018 16:55:14:041..5053586203564150333"},null,null,null,"Data",null,"End date",{"$f":"data!B9","v":"2015-09-30"},{"$f":"MATCH(K7, data!$B$9:$B$503, 0)","v":1}]
[null,"PCA",null,{"$f":"_xll.AC.stats.samplecalc.pca(D7)","v":"jmathkr.lib.stats.basic.calc.PCA@Tue, 23 Jan 2018 17:00:05:268..8542492353964120145"},null,null,null,"PCA calculator",null,"Start date",{"$f":"OFFSET(data!B8, MIN(L12, L8), 0)","v":"1991-06-30"},{"$f":"L12","v":98}]
[null,"Omega, Ω","3 x 3",{"$f":"_xll.AC.stats.samplecalc.get(D8, \"Omega\")","v":"java.util.ArrayList@Tue, 23 Jan 2018 16:55:14:179..8855141009962287983"},null,null,null,"Data covariance matrix",null,"Numbr of lags (p)",null,1]
[null,"eig-values, Λ","1 x 3",{"$f":"_xll.AC.stats.samplecalc.get(D8, \"eig-values\")","v":"java.util.ArrayList@Tue, 23 Jan 2018 16:55:14:180..7782185602862221564"},null,null,null,"Eigen-values",null,"Number of variables",null,3]
[null,"eig-vectors, V","3 x 3",{"$f":"_xll.AC.stats.samplecalc.get(D8, \"eig-vectors\")","v":"java.util.ArrayList@Tue, 23 Jan 2018 16:55:14:180..3803779192819881982"},null,null,null,"Eigen-vectors",null,"Sample size",null,{"$f":"L8+1-L7","v":98}]
[null,"I","3 x 3",{"$f":"_xll.AC.math.M.XXT(D11, 1, 1)","v":"java.util.ArrayList@Tue, 23 Jan 2018 16:55:14:191..4556911555166136080"},null,null,null,"Eigen-vector test: V x VT = I",null,"Total number of observations",null,{"$f":"COUNT(data!B9:B1003)","v":98}]
[null,"O = V x X","3 x n",{"$f":"_xll.AC.math.M.times(1, D11, D7)","v":"java.util.ArrayList@Tue, 23 Jan 2018 16:55:14:191..6364590822534946949"},null,null,null,"Data transformation into orthogonal system"]
[null,"O OT = Λ","3 x 3",{"$f":"_xll.AC.math.M.XXT(D13, 1/L11, 0)","v":"java.util.ArrayList@Tue, 23 Jan 2018 16:55:14:192..4792226313344705732"},null,null,null,"Test: O x OT = Λ"]
[null,null,null,null,null,null,null," "]
[]
[null,"B. Output",null,null,null,null,null," "]
[]
[null,null,null,null,null,null,null,null,null,"Test: VT Λ V = Ω",1,2,3,null,"O OT = Λ"]
[null,"Omega, Ω",null,{"$f":"data!C7","v":"3M"},{"$f":"data!D7","v":"5Y"},{"$f":"data!E7","v":"10Y"},null,"C0mments",null,"VT Λ V",{"$f":"D20","v":"3M"},{"$f":"E20","v":"5Y"},"10Y",null,{"$f":"K20","v":"3M"},{"$f":"L20","v":"5Y"},"10Y"]
[null,{"$f":"D20","v":"3M"},null,{"$f":"_xll.AC.data._get(D9, \"X\", 0)","v":0.98979591836734648},0.89555647180190112,0.80397467067770678,null,null,null,{"$f":"B21","v":"3M"},{"$f":"SUMPRODUCT(OFFSET($K$34:$M$34, K$19-1, 0), $K29:$M29)","v":0.98979591836734582},0.89555647180190101,0.80397467067770645,null,{"$f":"_xll.AC.data._get(D14, \"X\", 0)","v":2.7710770667536906},-3.2265856653168612E-16,-1.8214596497756474E-17]
[null,{"$f":"E20","v":"5Y"},null,0.89555647180190112,0.98979591836735126,0.96982025378611747,null,null,null,{"$f":"B22","v":"5Y"},0.8955564718019009,0.98979591836735137,0.96982025378611736,null,-2.7235158572835871E-16,0.19520789611289538,-8.4838819996990722E-17]
[null,{"$f":"F20","v":"10Y"},null,0.80397467067770678,0.96982025378611747,0.98979591836734848,null,null,null,"10Y",0.80397467067770634,0.96982025378611736,0.98979591836734837,null,-2.0383000842727483E-17,-8.5164080648736373E-17,3.1027922354594159E-3]
[]
[null,"Λ",null,{"$f":"D20","v":"3M"},{"$f":"E20","v":"5Y"},"10Y","√ (max / min)",null,null,null,{"$f":"D25","v":"3M"},{"$f":"E25","v":"5Y"},"10Y"]
[null,"eig-values",null,{"$f":"_xll.AC.data._get(D10, \"X\", 1)","v":2.7710770667536906},0.19520789611289513,3.1027922354596935E-3,{"$f":"SQRT(MAX(D26:F26) / MIN(D26:F26))","v":29.884634876488025},{"$f":"TEXT(MAX(K26:M26), \"#.#%\") &\" of variance is explained by first component\"","v":"93.3% of variance is explained by first component"},null,"explained var",{"$f":"D26/SUM($D$26:$F$26)","v":0.93321495718852676},{"$f":"E26/SUM($D$26:$F$26)","v":6.5740116216713732E-2},1.0449265947596203E-3]
[]
[null,"eig-vectors, V",null,{"$f":"D25","v":"3M"},{"$f":"E25","v":"5Y"},"10Y","SUM",null,null,"VT",{"$f":"D28","v":"3M"},{"$f":"E28","v":"5Y"},{"$f":"F28","v":"10Y"}]
[null,{"$f":"B21","v":"3M"},null,{"$f":"_xll.AC.data._get(D11, \"X\", 0)","v":0.55955679174999162},0.59528402150631499,0.57665685684445445,{"$f":"SUM(D29:F29)","v":1.7314976701007612},"The line presents the index of the main component",null,{"$f":"B29","v":"3M"},{"$f":"_xll.AC.data._get(D11, \"X\", 1)","v":0.55955679174999162},-0.79045142469339602,-0.24916408651055055]
[null,{"$f":"B22","v":"5Y"},null,-0.79045142469339602,0.17413607853338275,0.58725051839329712,{"$f":"SUM(D30:F30)","v":-2.906482776671615E-2},null,null,{"$f":"B30","v":"5Y"},0.59528402150631499,0.17413607853338275,0.7844192500775875]
[null,"10Y",null,-0.24916408651055055,0.7844192500775875,-0.5679821283289449,-3.2726964761907951E-2,null,null,"10Y",0.57665685684445445,0.58725051839329712,-0.5679821283289449]
[]
[null,"Test: VVT = I",null,{"$f":"D20","v":"3M"},{"$f":"E20","v":"5Y"},{"$f":"F20","v":"10Y"},null,null,null,"VT x Λ",{"$f":"K28","v":"3M"},{"$f":"L28","v":"5Y"},{"$f":"M28","v":"10Y"}]
[null,{"$f":"B29","v":"3M"},null,{"$f":"_xll.AC.data._get(D12, \"X\", 0)","v":1.0000000000000002},-5.5511151231257827E-17,-1.1102230246251565E-16,null,null,null,{"$f":"B34","v":"3M"},{"$f":"K29*D$26","v":1.5505749931646724},-0.1543023595938384,-7.7310439298034362E-4]
[null,{"$f":"B30","v":"5Y"},null,-5.5511151231257827E-17,1,1.6653345369377348E-16,null,null,null,{"$f":"B35","v":"5Y"},1.6495779002010602,3.3992737527851528E-2,2.4338899584858539E-3]
[null,{"$f":"B31","v":"10Y"},null,-1.1102230246251565E-16,1.6653345369377348E-16,0.99999999999999989,null,null,null,"10Y",1.5979605913879338,0.11463593818676256,-1.7623305376589214E-3]
[]
[]
[]
[]
{"$rows_left_out":135}
{"sheet":"charts","index":3,"n_rows":20,"n_cols":8,"rows_kept":20,"cut":false,"hidden":false,"merged":[]}
[]
[null,"TAB: CHARTS"]
[]
[null,"Variables and Index",null,null,null,null,null,"Normalized variables and main principal component"]
[]
[]
[]
[]
[]
[]
[]
[]
[]
[]
[]
[]
[]
[]
[]
[null,null,null,null,null,null,null,"Second and third principal components"]

{"sheet":"config","index":4,"n_rows":9,"n_cols":6,"rows_kept":9,"cut":false,"hidden":false,"merged":[]}
[]
[null,"TAB: CONFIGURATION FILE",null,null,"Calculations enabled:",false]
[]
[null,"Test connection",{"$f":"_xll.AC.test.connection()","v":"host: home-pc; user: Konstantin Rybakov; key: null"}]
[]
[]
[]
[null,"Array formula cell address","number of rows","number of \ncols","Description"]
[null,{"$f":"addressFla(calc!D21)","v":"'calc'!$D$21"},3,3,"Auto-regression model coefficients"]