{"text_format":"1","workbook":"xlsx","n_sheets":7,"sheets":["data","calc","charts","stats","test","config","guide"],"not_rendered":{"charts":3,"images":2,"macros":1,"external_links":0,"defined_names":11,"comments":0,"pivot_tables":0},"unopened":[],"bounds":{"document_bytes":16777216,"sheet_cells":100000,"rows_first":2000,"rows_last":500,"rows_between":2000,"halvings":0,"cell_chars":16384,"cell_head_chars":4096},"cells_cut":0,"cells_raw":0,"read":"whole","date_system":"1900"}

{"sheet":"data","index":0,"n_rows":4500,"n_cols":23,"rows_kept":4500,"cut":false,"hidden":false,"merged":[]}
[]
[null,"TAB: ECONOMIC FORECAST DATA, US UNEMPLOYMENT"]
[]
[null,null,null,"Individual Forecasts",null,null,null,null,null,null,null,null,null,null,null,null,"Actual Historical Data",null,null,null,"Tested entity forecasts"]
[null,"Date","ID","YEAR","QUARTER","ID","INDUSTRY","UNEMP1","UNEMP2","UNEMP3","UNEMP4","UNEMP5","UNEMP6","UNEMPA","UNEMPB",null,"Quarter","Date","UNEMP",null,"Quarter","MA","TD"]
[null,{"$f":"COUNT(B7:B10000)","v":3083},{"$f":"COUNTA(C7:C10000)","v":4494},{"$f":"E6","v":3083},{"$f":"B6","v":3083},{"$f":"B6","v":3083},{"$f":"F6","v":3083},3083,3083,3083,3083,3083,3083,{"$f":"M6","v":3083},{"$f":"N6","v":3083}]
[null,{"$f":"IF(D7=\"\", \"\", DATE(D7, 3*E7+1, 0))","v":"2000-03-31"},{"$f":"IF(D7=\"\", \"\", TEXT(F7, \"##\"))","v":"20"},2000,1,20,2,4.0999999999999996,4,4,4,4,4,4,4,null,"2000Q1","2000-03-31",4.0330000000000004,null,"2018Q3",3.71,3.758]
[null,{"$f":"IF(D8=\"\", \"\", DATE(D8, 3*E8+1, 0))","v":"2000-03-31"},{"$f":"IF(D8=\"\", \"\", TEXT(F8, \"##\"))","v":"40"},2000,1,40,2,4.0999999999999996,4.0999999999999996,4.0999999999999996,4.2,4.2,4.3,4.2,4.4000000000000004,null,"2000Q2","2000-06-30",3.9329999999999998,null,"2018Q4",3.64,3.6680000000000001]
[null,"2000-03-31","65",2000,1,65,2,4.0999999999999996,4.3,4.5,4.7,4.5999999999999996,4.5,4.5,4.45,null,"2000Q3","2000-09-30",4,null,"2019Q1",3.6,3.6179999999999999]
[null,"2000-03-31","84",2000,1,84,1,4.0999999999999996,4,3.9,3.9,4,"#N/A",3.9,"#N/A",null,"2000Q4","2000-12-31",3.9,null,"2019Q2",3.52,3.57]
[null,"2000-03-31","94",2000,1,94,1,4.0999999999999996,3.9,4,4.0999999999999996,4.2,4.3,4,4.3,null,"2001Q1","2001-03-31",4.2329999999999997,null,"2019Q3",3.48,3.5259999999999998]
[null,"2000-03-31","407",2000,1,407,1,4.0999999999999996,4,4,4,4.0999999999999996,4.0999999999999996,4,4.2,null,"2001Q2","2001-06-30",4.4000000000000004,null,"2019Q4",3.46,3.4950000000000001]
[null,"2000-03-31","411",2000,1,411,2,4.0999999999999996,4.0999999999999996,4.0999999999999996,4.0999999999999996,4.2,4.3,4.0999999999999996,4.5999999999999996,null,"2001Q3","2001-09-30",4.8330000000000002,null,"2020Q1",3.48,3.5169999999999999]
[null,"2000-03-31","414",2000,1,414,1,4.0999999999999996,3.9,3.9,4,3.9,4,4,4,null,"2001Q4","2001-12-31",5.5,null,"2020Q2",null,3.5819999999999999]
[null,"2000-03-31","420",2000,1,420,2,4.0999999999999996,4.0999999999999996,4.2,4.4000000000000004,4.4000000000000004,4.5,4.3,4.5999999999999996,null,"2002Q1","2002-03-31",5.7,null,"2020Q3",null,3.637]
{"$rows_left_out":4486}
{"sheet":"calc","index":1,"n_rows":36,"n_cols":14,"rows_kept":36,"cut":false,"hidden":false,"merged":[]}
[]
[null,"TAB: SAMPLE CALCULATOR"]
[]
[null,"Forecast sample",null,null,null,null,null,null,null,null,"Sample parameters"]
[]
[null,"Sample parameters",null,null,{"$f":"_xll.AC.data.map(B7:B8, E7:E8)","v":"java.util.LinkedHashMap@Sun, 4 Nov 2018 11:32:51:389..851238540758055296"}," ",null,{"$f":"_xll.AC.data.size(E6, 1)","v":2},null,null,"Variable-to-maturity mapping"]
[null,"variable-to-maturity",null,null,{"$f":"_xll.AC.data.map(K7:K12, L7:L12)","v":"java.util.LinkedHashMap@Sun, 4 Nov 2018 11:02:47:500..1880101886281130691"},null,null,{"$f":"_xll.AC.data.size(E7, 1)","v":6},null,null,{"$f":"data!H5","v":"UNEMP1"},0]
[null,{"$f":"config!I12","v":"sample-type"},null,null,{"$f":"config!I13","v":"sample-forecast-A"},null,null,null,null,null,{"$f":"data!I5","v":"UNEMP2"},{"$f":"L7+1","v":1}]
[null,null,null,null,null,null,null,"level","count",null,{"$f":"data!J5","v":"UNEMP3"},{"$f":"L8+1","v":2}]
[null,"Forecast sample object (maturity, issue date, forecaster-id)",null,null,{"$f":"_xll.AC.stats.sample.build(OFFSET(data!B7, 0, 0, M15, 2), OFFSET(data!H5, 0, 0, 1, M16), OFFSET(data!H7, 0, 0, M15, M16), 1, , E6)","v":"jmathkr.lib.stats.sample.model.forecast.ForecastSample@Sun, 4 Nov 2018 11:51:51:444..1171850624867846826"},null,null,{"$f":"_xll.AC.stats.sample.size(E10, -1)","v":0},6,null,{"$f":"data!K5","v":"UNEMP4"},3]
[null,null,null,null,null,null,null,1,75,null,{"$f":"data!L5","v":"UNEMP5"},4]
[null,null,null,null,null,null,null,2,53,null,{"$f":"data!M5","v":"UNEMP6"},5]
[]
[null,null,null,null,null,null,null,{"$f":"H9","v":"level"},{"$f":"I9","v":"count"}]
[null,"Sample with values for different forecaster-id converted to list",null,null,{"$f":"_xll.AC.stats.sample.listvalues(E10, _xll.AC.data._list_x(B34, 0, 1))","v":"jmathkr.lib.stats.sample.model.forecast.ForecastSample@Sun, 4 Nov 2018 11:51:51:450..5230935802401589158"},null,null,{"$f":"_xll.AC.stats.sample.size(E15, -1)","v":0},6,null,"Sample size",null,5000]
{"$rows_left_out":22}
{"sheet":"charts","index":2,"n_rows":22,"n_cols":10,"rows_kept":22,"cut":false,"hidden":false,"merged":[]}
[]
[null,"TAB: CHARTS"]
[]
[null,{"$f":"stats!B5","v":"UNEMP5"},"Table A: Forecasts presented as of the issue date",null,null,null,null,null,{"$f":"B4","v":"UNEMP5"},"TableB: Forecasts presented as of the maturity date"]
[]
[]
[]
[]
[]
[]
[]
[]
[]
[]
[]
{"$rows_left_out":8}
{"sheet":"stats","index":3,"n_rows":120,"n_cols":25,"rows_kept":120,"cut":false,"hidden":false,"merged":[]}
[]
[null,"TAB: SAMPLE STATISTICS"]
[]
[null,null,{"$f":"_xll.AC.stats.sample.get(calc!E16, calc!B25)","v":"java.util.ArrayList@Sun, 4 Nov 2018 11:30:41:132..5113537232288227201"},null,null,null,{"$f":"_xll.AC.data.size(C4, 1)","v":76},{"$f":"_xll.AC.data.size(C4, 2)","v":6},null,null,{"$f":"_xll.AC.stats.sample.get(calc!E18, calc!B26)","v":"java.util.ArrayList@Sun, 4 Nov 2018 11:30:41:148..6785703340943204264"},null,null,null,{"$f":"_xll.AC.data.size(K4, 1)","v":76},{"$f":"_xll.AC.data.size(K4, 2)","v":6},null,null,{"$f":"_xll.AC.stats.sample.get(calc!E16, calc!B28)","v":"java.util.ArrayList@Sun, 4 Nov 2018 11:35:39:523..4989287243227054456"},null,null,null,{"$f":"_xll.AC.data.size(S4, 1)","v":6},{"$f":"_xll.AC.data.size(S4, 2)","v":7}]
[null,{"$f":"calc!E25","v":"UNEMP5"},"Table A: Forecasts presented as of the issue date",null,null,null,null,null,null,null,{"$f":"B5","v":"UNEMP5"},"Table B: Forecasts presented as of the maturity date",null,null,null,null,null,null,{"$f":"calc!E33","v":"2018-09-30"},"Table C: Forecasts term structure as of given date"]
[]
[null,null,null,null,null,null,null,null,null,null,null,null,null,null,null,null,null,null,null,"Q01","Q02","Q03","Q04","Q05","Q06"]
[null,"Date of forecast",{"$f":"_xll.AC.data._get(C4, \"\", 0)","v":"Forecast issue date"},"min","percentile [0.25]","mean","percentile [0.75]","max","Historical",null,{"$f":"_xll.AC.data._get(K4, \"\", 0)","v":"Forecast maturity date"},"min","percentile [0.25]","mean","percentile [0.75]","max",{"$f":"I8","v":"Historical"},null,{"$f":"_xll.AC.data._get(S4, \"\", 0)","v":"Statistics"},"UNEMP1","UNEMP2","UNEMP3","UNEMP4","UNEMP5","UNEMP6"]
[null,null,"2000-03-31",3.6,3.9750000000000001,4.1166666666666671,4.3,4.5999999999999996,{"$f":"IF(C9=\"\", \"\", IF(ISERROR(VLOOKUP(C9, data!$R$7:$S$500, 2, FALSE)), \"\", VLOOKUP(C9, data!$R$7:$S$500, 2, FALSE)))","v":4.0330000000000004},null,"2001-03-31",3.6,3.9750000000000001,4.1166666666666671,4.3,4.5999999999999996,{"$f":"IF(K9=\"\", \"\", IF(ISERROR(VLOOKUP(K9, data!$R$7:$S$500, 2, FALSE)), \"\", VLOOKUP(K9, data!$R$7:$S$500, 2, FALSE)))","v":4.2329999999999997},null,"min",3.9,3.5859999999999999,3.4645000000000001,3.4079000000000002,3.2662,3.1924000000000001]
[null,{"$f":"C9","v":"2000-03-31"},"2000-06-30",3.6,4,4.0617647058823527,4.2,4.5,{"$f":"IF(C10=\"\", \"\", IF(ISERROR(VLOOKUP(C10, data!$R$7:$S$500, 2, FALSE)), \"\", VLOOKUP(C10, data!$R$7:$S$500, 2, FALSE)))","v":3.9329999999999998},null,"2001-06-30",3.6,4,4.0617647058823527,4.2,4.5,{"$f":"IF(K10=\"\", \"\", IF(ISERROR(VLOOKUP(K10, data!$R$7:$S$500, 2, FALSE)), \"\", VLOOKUP(K10, data!$R$7:$S$500, 2, FALSE)))","v":4.4000000000000004},null,"percentile [0.25]",3.9,3.8,3.6658500000000003,3.5926,3.5,3.4]
[null,{"$f":"IF(C10=\"\", \"\", C10)","v":"2000-06-30"},"2000-09-30",3.7,4.0250000000000004,4.1790322580645158,4.3,4.8,{"$f":"IF(C11=\"\", \"\", IF(ISERROR(VLOOKUP(C11, data!$R$7:$S$500, 2, FALSE)), \"\", VLOOKUP(C11, data!$R$7:$S$500, 2, FALSE)))","v":4},null,"2001-09-30",3.7,4.0250000000000004,4.1790322580645158,4.3,4.8,{"$f":"IF(K11=\"\", \"\", IF(ISERROR(VLOOKUP(K11, data!$R$7:$S$500, 2, FALSE)), \"\", VLOOKUP(K11, data!$R$7:$S$500, 2, FALSE)))","v":4.8330000000000002},null,"mean",3.9000000000000026,3.8317277777777781,3.7323388888888891,3.6794194444444437,3.6684694444444443,3.6437722222222217]
[null,{"$f":"IF(C11=\"\", \"\", C11)","v":"2000-09-30"},"2000-12-31",3.9,4.0999999999999996,4.2167647058823512,4.2524999999999995,5.3,{"$f":"IF(C12=\"\", \"\", IF(ISERROR(VLOOKUP(C12, data!$R$7:$S$500, 2, FALSE)), \"\", VLOOKUP(C12, data!$R$7:$S$500, 2, FALSE)))","v":3.9},null,"2001-12-31",3.9,4.0999999999999996,4.2167647058823512,4.2524999999999995,5.3,{"$f":"IF(K12=\"\", \"\", IF(ISERROR(VLOOKUP(K12, data!$R$7:$S$500, 2, FALSE)), \"\", VLOOKUP(K12, data!$R$7:$S$500, 2, FALSE)))","v":5.5},null,"percentile [0.75]",3.9,3.890425,3.8,3.7562500000000001,3.8,3.7571750000000002]
[null,"2000-12-31","2001-03-31",4,4.3,4.5357142857142847,4.75,5.3,{"$f":"IF(C13=\"\", \"\", IF(ISERROR(VLOOKUP(C13, data!$R$7:$S$500, 2, FALSE)), \"\", VLOOKUP(C13, data!$R$7:$S$500, 2, FALSE)))","v":4.2329999999999997},null,"2002-03-31",4,4.3,4.5357142857142847,4.75,5.3,{"$f":"IF(K13=\"\", \"\", IF(ISERROR(VLOOKUP(K13, data!$R$7:$S$500, 2, FALSE)), \"\", VLOOKUP(K13, data!$R$7:$S$500, 2, FALSE)))","v":5.7},null,"max",3.9,4,4,4.0999999999999996,4.3,4.5999999999999996]
[null,"2001-03-31","2001-06-30",4.3,4.5999999999999996,4.8181818181818183,5,5.5,{"$f":"IF(C14=\"\", \"\", IF(ISERROR(VLOOKUP(C14, data!$R$7:$S$500, 2, FALSE)), \"\", VLOOKUP(C14, data!$R$7:$S$500, 2, FALSE)))","v":4.4000000000000004},null,"2002-06-30",4.3,4.5999999999999996,4.8181818181818183,5,5.5,{"$f":"IF(K14=\"\", \"\", IF(ISERROR(VLOOKUP(K14, data!$R$7:$S$500, 2, FALSE)), \"\", VLOOKUP(K14, data!$R$7:$S$500, 2, FALSE)))","v":5.8330000000000002}]
[null,"2001-06-30","2001-09-30",4.2,4.8,4.9181818181818189,5,5.7,{"$f":"IF(C15=\"\", \"\", IF(ISERROR(VLOOKUP(C15, data!$R$7:$S$500, 2, FALSE)), \"\", VLOOKUP(C15, data!$R$7:$S$500, 2, FALSE)))","v":4.8330000000000002},null,"2002-09-30",4.2,4.8,4.9181818181818189,5,5.7,{"$f":"IF(K15=\"\", \"\", IF(ISERROR(VLOOKUP(K15, data!$R$7:$S$500, 2, FALSE)), \"\", VLOOKUP(K15, data!$R$7:$S$500, 2, FALSE)))","v":5.7329999999999997}]
{"$rows_left_out":106}
{"sheet":"test","index":4,"n_rows":155,"n_cols":32,"rows_kept":155,"cut":false,"hidden":false,"merged":[]}
[]
[null,"SAMPLE TESTING"]
[null,null,null,null,null,null,null,null,null,null,null,null,null,null,null,null,null,null,null,null,null,null,null,{"$f":"B7","v":"issue-date"},null,null,null,null,null,{"$f":"_xll.AC.stats.sample.size(Y5, -1)","v":0},75]
[null,"Test (difference between Feds and estimated mean forecasts)",null,null,null,null,null,null,null,null,null,null,null,"Sample view as of issue date",null,null,null,null,null,null,null,null,null,{"$f":"B8","v":"forecaster-id"},null,null,null,null,null,1,53]
[null,null,null,null,null,null,null,null,null,null,null,null,null,null,null,null,null,null,null,null,null,null,null,{"$f":"B10","v":"maturity"},{"$f":"_xll.AC.stats.sample.permute(calc!E10, _xll.AC.data.list_x(X3:X5, 0, 1))","v":"jmathkr.lib.stats.sample.model.forecast.ForecastSample@Sun, 4 Nov 2018 11:51:51:464..8617707287225909542"},null,null,null,null,2,6]
[null,"Key ids",null,"Column names",null,null,"Parameter key",null,null,"Parameter value",null,null,null,{"$f":"J6","v":"Parameter value"},null,null,{"$f":"J6","v":"Parameter value"},null,null,null,null,null,null,{"$f":"Q6","v":"Parameter value"}]
[null,{"$f":"config!G41","v":"issue-date"},null,{"$f":"config!C19","v":"Forecast issue date"},null,null,{"$f":"config!G40","v":"field-key"},null,null,null,null,null,null,null,null,null,{"$f":"config!G43","v":"forecast-value"},null,null,null,null,null,null,{"$f":"Q7","v":"forecast-value"}]
[null,{"$f":"config!G34","v":"forecaster-id"},null,{"$f":"config!C20","v":"Forecaster id"},null,null,{"$f":"config!G20","v":"values-only"},null,null,0,null,null,null,0,null,null,0,null,null,null,null,null,null,0]
[null,{"$f":"B7","v":"issue-date"},null,{"$f":"D7","v":"Forecast issue date"},null,null,{"$f":"config!G21","v":"key-id"},null,null,{"$f":"config!G41","v":"issue-date"},null,null,null,{"$f":"J9","v":"issue-date"},null,null,{"$f":"config!G41","v":"issue-date"},null,null,null,null,null,null,"issue-date"]
[null,{"$f":"config!G36","v":"maturity"},null,{"$f":"config!C17","v":"Forecast maturity"},null,null,{"$f":"config!G22","v":"key-value"},null,null,{"$f":"calc!E33","v":"2018-09-30"},null,null,null,{"$f":"J10","v":"2018-09-30"},null,null,{"$f":"calc!E33","v":"2018-09-30"},null,null,null,null,null,null,"2018-09-30"]
[null,{"$f":"config!G38","v":"stats-id"},null,null,null,null,{"$f":"config!G23","v":"key-ids-row"},null,null,{"$f":"_xll.AC.data.list_x(B7, 0, 1)","v":"java.util.ArrayList@Sun, 4 Nov 2018 11:16:17:853..6878887748575010429"},null,null," ",{"$f":"_xll.AC.data.list_x(B9:B10, 0, 1)","v":"java.util.ArrayList@Sun, 4 Nov 2018 10:06:10:871..4641861212243486907"},null," ",{"$f":"_xll.AC.data.list_x(B7:B8, 0, 1)","v":"java.util.ArrayList@Sun, 4 Nov 2018 10:06:11:341..4787787208283434997"},null," ",null,null," ",null,"java.util.ArrayList@Sun, 4 Nov 2018 10:06:11:341..4787787208283434997",null," "]
[null,null,null,null,null,null,{"$f":"config!G24","v":"key-ids-col"},null,null,{"$f":"_xll.AC.data.list_x(B10, 0, 1)","v":"java.util.ArrayList@Sun, 4 Nov 2018 10:06:10:876..1974526267439168518"},null,null," ",{"$f":"_xll.AC.data.list_x(B11, 0, 1)","v":"java.util.ArrayList@Sun, 4 Nov 2018 11:16:17:853..8484275513342818042"},null," ",{"$f":"_xll.AC.data.list_x(B10, 0, 1)","v":"java.util.ArrayList@Sun, 4 Nov 2018 10:06:10:876..1974526267439168518"},null," ",null,null," ",null,"java.util.ArrayList@Sun, 4 Nov 2018 10:06:10:876..1974526267439168518",null," "]
[null,null,null,null,null,null,{"$f":"config!G26","v":"table-header-names"},null,null,{"$f":"_xll.AC.data.list_x(D7, 0, 1)","v":"java.util.ArrayList@Sun, 4 Nov 2018 11:16:17:853..1408317048091918134"},null,null," ",{"$f":"_xll.AC.data.list_x(D9:D10, 0, 1)","v":"java.util.ArrayList@Sun, 4 Nov 2018 10:06:10:873..8272845387448187836"},null," ",{"$f":"_xll.AC.data.list_x(D7:D8, 0, 1)","v":"java.util.ArrayList@Sun, 4 Nov 2018 11:16:17:853..6945682525923402728"},null," ",null,null," ",null,"java.util.ArrayList@Sun, 4 Nov 2018 11:16:17:853..6945682525923402728",null," "]
[null,null,null,null,null,null,{"$f":"config!G28","v":"log-level-debug"},null,null,{"$f":"Q14","v":0},null,null,null,0,null,null,0,null,null,null,null,null,null,0]
[null,null,null,null," ",null,null,null,null,{"$f":"_xll.AC.data.map(G8:G14, J8:J14)","v":"java.util.LinkedHashMap@Sun, 4 Nov 2018 11:16:18:040..1760577246356352006"},null,null,{"$f":"_xll.AC.data.size(J15, 1)","v":7},{"$f":"_xll.AC.data.map(G8:G14, N8:N14)","v":"java.util.LinkedHashMap@Sun, 4 Nov 2018 11:16:18:056..308839915315577908"},null,{"$f":"_xll.AC.data.size(N15, 1)","v":7},{"$f":"_xll.AC.data.map(G7:G14, Q7:Q14)","v":"java.util.LinkedHashMap@Sun, 4 Nov 2018 11:16:18:040..1488118861106218473"},null,{"$f":"_xll.AC.data.size(Q15, 1)","v":8},null,null,null,null,{"$f":"_xll.AC.data.map(G7:G14, X7:X14)","v":"java.util.LinkedHashMap@Sun, 4 Nov 2018 11:16:18:040..1488118861106218473"},null,null,{"$f":"_xll.AC.data.size(X15, 1)","v":8}]
{"$rows_left_out":141}
{"sheet":"config","index":5,"n_rows":44,"n_cols":10,"rows_kept":44,"cut":false,"hidden":false,"merged":[]}
[]
[null,"TAB: CONFIGURATION FILE"]
[]
[null,"Test connection",{"$f":"_xll.AC.test.connection()","v":"host: CA2013466W3; user: Konstantin.Rybakov; key: null"},null,null,null,"Enable calculations",false]
[]
[null,"Array formula cell address","number of rows","number of \ncols","Description",null,"Parameter","Description"]
[null,{"$f":"addressFla(stats!$C$8)","v":"'stats'!$C$8"},{"$f":"stats!G4","v":76},{"$f":"stats!H4","v":6},"Forecast sample as of forecast issue date",null,"Statistics","Sample statistics","Data types","Sample key data types"]
[null,{"$f":"addressFla(stats!K8)","v":"'stats'!$K$8"},{"$f":"stats!O4","v":76},{"$f":"stats!P4","v":6},"Forecast sample as of forecast maturity date",null,"min",null,"date"]
[null,{"$f":"addressFla(stats!S8)","v":"'stats'!$S$8"},{"$f":"stats!W4","v":6},{"$f":"stats!X4","v":7},"Forecast sample with different maturities",null,"max",null,"int"]
[null,{"$f":"addressFla(test!N19)","v":"'test'!$N$19"},{"$f":"MIN(test!P17, 11)","v":2},{"$f":"test!Q17","v":7},{"$f":"test!M18","v":"Sample with forecaster-id values repersented as lists"},null,"mean",null,"double"]
[null,{"$f":"addressFla(test!N33)","v":"'test'!$N$33"},{"$f":"MIN(test!P31, 11)","v":7},{"$f":"test!Q31","v":7},{"$f":"test!M32","v":"Sample with statistics calculated over the forecaster-id values"},null,"median",null,"string"]
[null,{"$f":"addressFla(test!N47)","v":"'test'!$N$47"},{"$f":"test!P45","v":37},{"$f":"test!Q45","v":8},{"$f":"test!M46","v":"Original sample (at a specific issue date)"},null,"stdev",null,"sample-type","Type of the constructed sample"]
[null,{"$f":"addressFla(test!Y19)","v":"'test'!$Y$19"},{"$f":"test!AA17","v":37},{"$f":"test!AB17","v":8},{"$f":"test!X18","v":"Sample with permutated keys"},null,"variance",null,"sample-forecast-A"]
[null,null,null,null,null,null,"percentile",null,"sample-forecast-B"]
[null,"Supplementary output parameters",null,null,null,null,null,null,"period-unit","Duration of a forecast period unit"]
{"$rows_left_out":30}
{"sheet":"guide","index":6,"n_rows":2,"n_cols":2,"rows_kept":2,"cut":false,"hidden":false,"merged":[[1,1,32,8]]}
[]
[null,"Package: AC.stats.sample\n\nAvailable functions:\n"]