{"text_format":"1","workbook":"xlsx","n_sheets":10,"sheets":["data","calc","hist","current","charts","historical","date-publish","test","config","guide"],"not_rendered":{"charts":4,"images":2,"macros":1,"external_links":0,"defined_names":17,"comments":0,"pivot_tables":0},"unopened":[],"bounds":{"document_bytes":16777216,"sheet_cells":100000,"rows_first":2000,"rows_last":500,"rows_between":2000,"halvings":0,"cell_chars":16384,"cell_head_chars":4096},"cells_cut":0,"cells_raw":0,"read":"whole","date_system":"1900"}

{"sheet":"data","index":0,"n_rows":215,"n_cols":41,"rows_kept":215,"cut":false,"hidden":false,"merged":[]}
[]
[null,"TAB: ECONOMIC FORECAST DATA, CANADIAN UNEMPLOYMENT RATE"]
[]
[null,"ECUPCA"]
[null,null,"Q117",null,"Q217",null,"Q317",null,"Q417",null,"Q118",null,"Q218",null,"Q318",null,"Q418",null,"Q119",null,"Q219",null,"Q319",null,"Q419",null,"Q120",null,"Q220",null,"Q320",null,"Q420",null,"Q121",null,"Q221",null,"Q321",null,"Q421"]
[null,null,"Date","Last Price","Date","Last Price","Date","Last Price","Date","Last Price","Date","Last Price","Date","Last Price","Date","Last Price","Date","Last Price","Date","Last Price","Date","Last Price","Date","Last Price","Date","Last Price","Date","Last Price","Date","Last Price","Date","Last Price","Date","Last Price"]
[null,"BMO","2017-03-17",6.6,"2017-06-09",6.6,"2017-09-08",6.4,"2017-12-15",6,"2018-03-16",5.8,"2018-06-08",5.8,"2018-09-13",5.9,"2018-10-12",5.8,"2018-10-12",5.7,"2018-10-12",5.7,"2018-10-12",5.6,"2018-10-12",5.6]
[null,"BMO","2017-02-10",6.9,"2017-05-12",6.6,"2017-08-11",6.4,"2017-11-10",6.3,"2018-02-09",5.8,"2018-05-11",5.8,"2018-08-10",5.9,"2018-09-13",5.8,"2018-09-13",5.7,"2018-09-13",5.7,"2018-09-13",5.6,"2018-09-13",5.6]
[null,"BMO","2017-01-13",6.9,"2017-04-14",6.7,"2017-07-14",6.5,"2017-10-13",6.2,"2018-01-12",5.7,"2018-04-13",5.8,"2018-07-12",5.9,"2018-08-10",5.7,"2018-08-10",5.7,"2018-08-10",5.7,"2018-08-10",5.6,"2018-08-10",5.6]
[null,"BMO","2016-12-09",6.9,"2017-03-17",6.6,"2017-06-09",6.6,"2017-09-08",6.3,"2017-12-15",6,"2018-03-16",5.8,"2018-06-08",5.6,"2018-07-12",5.7,"2018-07-12",5.7,"2018-07-12",5.7,"2018-07-12",5.6,"2018-07-12",5.6]
{"$rows_left_out":206}
{"sheet":"calc","index":1,"n_rows":34,"n_cols":20,"rows_kept":34,"cut":false,"hidden":false,"merged":[[5,17,5,18]]}
[]
[null,"TAB: SAMPLE CALCULATOR"]
[]
[null,"Forecast sample",null,null,null,null,null,null,null,null,null,"Sample parameters"]
[]
[null,"Sample parameters",null,null,null,{"$f":"_xll.AC.data.map(B7:B10, F7:F10)","v":"java.util.LinkedHashMap@Sun, 4 Nov 2018 07:46:59:016..4529959416953293718"},null,null,null,null,{"$f":"_xll.AC.data.size(F6, 1)","v":4},"Statistics",null,"Object",null,null,null,"Variable-to-maturity mapping"]
[null,"variable-to-maturity",null,null,null,{"$f":"_xll.AC.data.map(R7:R34, S7:S34)","v":"java.util.LinkedHashMap@Sun, 4 Nov 2018 07:46:59:014..2567602432548487402"},null,null,null,null,{"$f":"_xll.AC.data.size(F7, 1)","v":28},{"$f":"config!I8","v":"min"},null,{"$f":"_xll.AC.data.list_x(L7:L11, 0, 1)","v":"java.util.ArrayList@Sun, 4 Nov 2018 07:46:59:461..4030148381231940790"},null,{"$f":"_xll.AC.data.size(N7, 1)","v":5},null,"Q117","2017-03-31"]
[null,{"$f":"config!K12","v":"sample-type"},null,null,null,{"$f":"config!K14","v":"sample-forecast-B"},null,null,null,null,null,{"$f":"config!I14","v":"percentile"},0.25,{"$f":"_xll.AC.data.list_x(M7:M11, 0, 0)","v":"java.util.ArrayList@Sun, 4 Nov 2018 07:46:59:015..2869625540094446348"},null,{"$f":"_xll.AC.data.size(N8, 1)","v":5},null,"Q217",{"$f":"DATE(YEAR(S7), MONTH(S7)+4, 0)","v":"2017-06-30"}]
[null,{"$f":"config!I27","v":"tenor-id-mapping"},null,null,null,{"$f":"_xll.AC.data.map(config!F15:F31, config!G15:G31)","v":"java.util.LinkedHashMap@Sun, 4 Nov 2018 07:46:59:011..3507757597860174109"},null,null,null,null,{"$f":"_xll.AC.data.size(F9, 1)","v":17},{"$f":"config!I10","v":"mean"},null,null,null,null,null,"Q317",{"$f":"DATE(YEAR(S8), MONTH(S8)+4, 0)","v":"2017-09-30"}]
[null,{"$f":"config!I28","v":"issue-date-match-weight"},null,null,null,0.5,null,null,null,null,null,{"$f":"L8","v":"percentile"},0.75,null,null,null,null,"Q417","2017-12-31"]
{"$rows_left_out":25}
{"sheet":"hist","index":2,"n_rows":25,"n_cols":17,"rows_kept":25,"cut":false,"hidden":false,"merged":[]}
[]
[null,"TAB: SAMPLE HISTORICAL FORECAST SERIES FOR SELECTED MATURITY TERM"]
[]
[null,null,null,null,null,null,{"$f":"_xll.AC.stats.sample.get(calc!F14, calc!B19)","v":"java.util.ArrayList@Sun, 4 Nov 2018 07:46:59:520..9150319401843876203"},null,null,null,{"$f":"_xll.AC.data.size(G4, 1)","v":12},{"$f":"_xll.AC.data.size(G4, 2)","v":11}]
[null,null,null,null,null,null,{"$f":"calc!F21","v":"Q04"},"Table A: Forecasts series presented as of the maturity date"]
[]
[null,"Min","Median","Max","Historical",null,{"$f":"_xll.AC.data._get(G4, \"\", 0)","v":"Forecast maturity date"},"OE","TD","BMO","BNS","CE","CIBC","IHS","MCO","NBF","RBC"]
[null,{"$f":"IF(G8=\"\", \"\", MIN(I8:N8))","v":6.8},{"$f":"IF(G8=\"\", \"\", MEDIAN(H8:N8))","v":7.2},{"$f":"IF(G8=\"\", \"\", MAX(I8:N8))","v":7.3},{"$f":"IF(ISERROR(VLOOKUP(G8, historical!$K$8:$L$81, 2, FALSE)), \"\", VLOOKUP(G8, historical!$K$8:$L$81, 2, FALSE))","v":6.7},null,"2017-03-31",7.2,"",7.2,7.3,"",7.2,6.8,6.7,7.4,6.8]
[null,{"$f":"IF(G9=\"\", \"\", MIN(I9:N9))","v":6.9},{"$f":"IF(G9=\"\", \"\", MEDIAN(H9:N9))","v":6.9},{"$f":"IF(G9=\"\", \"\", MAX(I9:N9))","v":7},{"$f":"IF(ISERROR(VLOOKUP(G9, historical!$K$8:$L$81, 2, FALSE)), \"\", VLOOKUP(G9, historical!$K$8:$L$81, 2, FALSE))","v":6.53},null,"2017-06-30",7.1,"",6.9,7,"",6.9,6.9,6.6,7.4,6.7]
[null,{"$f":"IF(G10=\"\", \"\", MIN(I10:N10))","v":6.8},{"$f":"IF(G10=\"\", \"\", MEDIAN(H10:N10))","v":6.9},{"$f":"IF(G10=\"\", \"\", MAX(I10:N10))","v":7},{"$f":"IF(ISERROR(VLOOKUP(G10, historical!$K$8:$L$81, 2, FALSE)), \"\", VLOOKUP(G10, historical!$K$8:$L$81, 2, FALSE))","v":6.23},null,"2017-09-30",7.3,"",6.8,7,"",6.9,6.8,6.6,7.1,6.7]
{"$rows_left_out":16}
{"sheet":"current","index":3,"n_rows":24,"n_cols":10,"rows_kept":24,"cut":false,"hidden":false,"merged":[]}
[]
[null,"TAB: SAMPLE FORECAST TERM STRUCTURE FOR SELECTED ISSUE DATE"]
[]
[]
[null,{"$f":"_xll.AC.stats.sample.get(calc!F13, calc!B20)","v":"java.util.ArrayList@Sun, 4 Nov 2018 07:46:59:515..1058160564892093942"},null,null,null,{"$f":"_xll.AC.data.size(B5, 1)","v":11},{"$f":"_xll.AC.data.size(B5, 2)","v":8}]
[null,{"$f":"calc!H21","v":"2018-09-30"},{"$f":"\"Table B: Forecasts term structure as of given date \"  & TEXT(B6, \"dd-MMM-yy\")","v":"Table B: Forecasts term structure as of given date 30-Sep-18"}]
[]
[null,"Min",{"$f":"IF(C14=\"\", \"\", MIN(C16:C23))","v":5.8},{"$f":"IF(D14=\"\", \"\", MIN(D16:D23))","v":5.8},{"$f":"IF(E14=\"\", \"\", MIN(E16:E23))","v":5.7},{"$f":"IF(F14=\"\", \"\", MIN(F16:F23))","v":5.7},{"$f":"IF(G14=\"\", \"\", MIN(G16:G23))","v":5.6},{"$f":"IF(H14=\"\", \"\", MIN(H16:H23))","v":5.6},{"$f":"IF(I14=\"\", \"\", MIN(I16:I23))","v":5.7},{"$f":"IF(J14=\"\", \"\", MIN(J16:J23))","v":""}]
[null,"Median",{"$f":"IF(ISERROR(MEDIAN(C15:C21)), \"\", MEDIAN(C15:C21))","v":5.9},{"$f":"IF(ISERROR(MEDIAN(D15:D21)), \"\", MEDIAN(D15:D21))","v":5.9},{"$f":"IF(ISERROR(MEDIAN(E15:E21)), \"\", MEDIAN(E15:E21))","v":5.8},{"$f":"IF(ISERROR(MEDIAN(F15:F21)), \"\", MEDIAN(F15:F21))","v":5.9},{"$f":"IF(ISERROR(MEDIAN(G15:G21)), \"\", MEDIAN(G15:G21))","v":6},{"$f":"IF(ISERROR(MEDIAN(H15:H21)), \"\", MEDIAN(H15:H21))","v":6},{"$f":"IF(ISERROR(MEDIAN(I15:I21)), \"\", MEDIAN(I15:I21))","v":6.2},{"$f":"IF(ISERROR(MEDIAN(J15:J21)), \"\", MEDIAN(J15:J21))","v":""}]
[null,"Max",{"$f":"IF(C14=\"\", \"\", MAX(C16:C23))","v":6},{"$f":"IF(D14=\"\", \"\", MAX(D16:D23))","v":6.1},{"$f":"IF(E14=\"\", \"\", MAX(E16:E23))","v":6.2},{"$f":"IF(F14=\"\", \"\", MAX(F16:F23))","v":6.2},{"$f":"IF(G14=\"\", \"\", MAX(G16:G23))","v":6.4},{"$f":"IF(H14=\"\", \"\", MAX(H16:H23))","v":6.5},{"$f":"IF(I14=\"\", \"\", MAX(I16:I23))","v":6.4},{"$f":"IF(J14=\"\", \"\", MAX(J16:J23))","v":""}]
{"$rows_left_out":15}
{"sheet":"charts","index":4,"n_rows":29,"n_cols":10,"rows_kept":29,"cut":false,"hidden":false,"merged":[]}
[]
[null,"TAB: CHARTS - CENTRAL BANK RATE, US"]
[]
[null,"Charts with individual contributors data"]
[]
[null,"Chart index",1,null,null,null,null,null,"Chart index",2]
[null,{"$f":"calc!F21","v":"Q04"},{"$f":"hist!H5","v":"Table A: Forecasts series presented as of the maturity date"},null,null,null,null,null,{"$f":"calc!H21","v":"2018-09-30"},{"$f":"current!C6","v":"Table B: Forecasts term structure as of given date 30-Sep-18"}]
[]
[]
[]
{"$rows_left_out":20}
{"sheet":"historical","index":5,"n_rows":81,"n_cols":12,"rows_kept":81,"cut":false,"hidden":false,"merged":[[4,1,4,2],[4,4,4,5],[4,7,4,8],[4,10,4,11]]}
[]
[null,"TAB: ECONOMIC HISTORICAL DATA, CANADA GDP, Gross Fixed Investment Income, CPI, Unemployment"]
[]
[]
[null,"01. EHGDCA - Canada GDP",null,null,"02. CGE9GFCF - Canada Gross Fixed Investment Income",null,null,"03. EHPICA - Canada CPI",null,null,"04. EHUPCA - Canada Unemployment"]
[]
[null,"Date","Mid Price",null,"Date","Mid Price",null,"Date","Mid Price",null,"Date","Mid Price"]
[null,"2018-06-30","NA",null,"2018-06-30","NA",null,"2018-06-30","NA",null,"2018-06-30",5.87]
[null,"2018-03-31",1.35,null,"2018-03-31",3.9,null,"2018-03-31",2.0699999999999998,null,"2018-03-31",5.83]
[null,"2017-12-31",1.7,null,"2017-12-31",9.5,null,"2017-12-31",1.8,null,"2017-12-31",5.97]
{"$rows_left_out":72}
{"sheet":"date-publish","index":6,"n_rows":136,"n_cols":30,"rows_kept":136,"cut":false,"hidden":false,"merged":[]}
[]
[null,"SAMPLE PUBLISH DATES"]
[]
[null,{"$f":"_xll.AC.stats.sample.get(calc!F13, calc!B22)","v":"java.util.ArrayList@Sun, 4 Nov 2018 07:46:59:495..2676883671726158841"},null,null,{"$f":"_xll.AC.data.size(B4, 1)","v":131},{"$f":"_xll.AC.data.size(B4, 2)","v":10}]
[null,"Table C: forecast publish dates",null,null,null,null,null,null,null,null,null,null,null,null,null,null,null,null,null,null,null,"Publish date row index"]
[null,{"$f":"_xll.AC.data._get(B4, \"\", 0)","v":"Forecast issue date"},"Entity name","Q00","Q01","Q02","Q03","Q04","Q05","Q06","Q07",null,null,null,null,{"$f":"B6","v":"Forecast issue date"},"Forecast issue quarter",{"$f":"C6","v":"Entity name"},"Entity row index","Q0 Maturity column index",null,{"$f":"IF(D6=\"\", \"\", OFFSET(config!$F$14, MATCH(D6, config!$G$15:$G$40, 0), 0))","v":0},{"$f":"IF(E6=\"\", \"\", OFFSET(config!$F$14, MATCH(E6, config!$G$15:$G$40, 0), 0))","v":1},{"$f":"IF(F6=\"\", \"\", OFFSET(config!$F$14, MATCH(F6, config!$G$15:$G$40, 0), 0))","v":2},{"$f":"IF(G6=\"\", \"\", OFFSET(config!$F$14, MATCH(G6, config!$G$15:$G$40, 0), 0))","v":3},{"$f":"IF(H6=\"\", \"\", OFFSET(config!$F$14, MATCH(H6, config!$G$15:$G$40, 0), 0))","v":4},{"$f":"IF(I6=\"\", \"\", OFFSET(config!$F$14, MATCH(I6, config!$G$15:$G$40, 0), 0))","v":5},{"$f":"IF(J6=\"\", \"\", OFFSET(config!$F$14, MATCH(J6, config!$G$15:$G$40, 0), 0))","v":6},{"$f":"IF(K6=\"\", \"\", OFFSET(config!$F$14, MATCH(K6, config!$G$15:$G$40, 0), 0))","v":7},{"$f":"IF(L6=\"\", \"\", OFFSET(config!$F$14, MATCH(L6, config!$G$15:$G$40, 0), 0))","v":""}]
[null,"2017-03-31","BMO","2017-03-17","2017-04-14","2017-04-14","2017-04-14","2017-04-14","2017-04-14","2017-04-14","",null,null,null,null,{"$f":"IF(B7=\"\", \"\", B7)","v":"2017-03-31"},{"$f":"IF(P7=\"\", \"\", IF(ISERROR(OFFSET(calc!$R$6, MATCH(P7, calc!$S$7:$S$18, 0), 0)), \"\",  OFFSET(calc!$R$6, MATCH(P7, calc!$S$7:$S$18, 0), 0)))","v":"Q117"},{"$f":"IF(C7=\"\", \"\", C7)","v":"BMO"},{"$f":"IF(R7=\"\", \"\", MATCH(R7, data!$B$7:$B$988, 0))","v":1},{"$f":"IF(Q7=\"\", \"\", 2*MATCH(Q7, calc!$R$7:$R$23, 0)-1)","v":1},null,{"$f":"IF(OR(D7=\"\", $T7=\"\"), \"\", ($S7-1) + MATCH(D7, OFFSET(data!$B$6, $S7, $T7+2*V$6, 500, 1), 0))","v":1},{"$f":"IF(OR(E7=\"\", $T7=\"\"), \"\", ($S7-1) + MATCH(E7, OFFSET(data!$B$6, $S7, $T7+2*W$6, 500, 1), 0))","v":3},{"$f":"IF(OR(F7=\"\", $T7=\"\"), \"\", ($S7-1) + MATCH(F7, OFFSET(data!$B$6, $S7, $T7+2*X$6, 500, 1), 0))","v":6},{"$f":"IF(OR(G7=\"\", $T7=\"\"), \"\", ($S7-1) + MATCH(G7, OFFSET(data!$B$6, $S7, $T7+2*Y$6, 500, 1), 0))","v":9},{"$f":"IF(OR(H7=\"\", $T7=\"\"), \"\", ($S7-1) + MATCH(H7, OFFSET(data!$B$6, $S7, $T7+2*Z$6, 500, 1), 0))","v":12},{"$f":"IF(OR(I7=\"\", $T7=\"\"), \"\", ($S7-1) + MATCH(I7, OFFSET(data!$B$6, $S7, $T7+2*AA$6, 500, 1), 0))","v":15},{"$f":"IF(OR(J7=\"\", $T7=\"\"), \"\", ($S7-1) + MATCH(J7, OFFSET(data!$B$6, $S7, $T7+2*AB$6, 500, 1), 0))","v":18},{"$f":"IF(OR(K7=\"\", $T7=\"\"), \"\", ($S7-1) + MATCH(K7, OFFSET(data!$B$6, $S7, $T7+2*AC$6, 500, 1), 0))","v":""},{"$f":"IF(OR(L7=\"\", $T7=\"\"), \"\", ($S7-1) + MATCH(L7, OFFSET(data!$B$6, $S7, $T7+2*AD$6, 500, 1), 0))","v":""}]
[null,"2017-03-31","CIBC","2017-04-03","2017-04-03","2017-04-03","2017-04-03","2017-04-03","2017-04-03","2017-04-03","",null,null,null,null,{"$f":"IF(B8=\"\", \"\", B8)","v":"2017-03-31"},{"$f":"IF(P8=\"\", \"\", IF(ISERROR(OFFSET(calc!$R$6, MATCH(P8, calc!$S$7:$S$18, 0), 0)), \"\",  OFFSET(calc!$R$6, MATCH(P8, calc!$S$7:$S$18, 0), 0)))","v":"Q117"},"CIBC",{"$f":"IF(R8=\"\", \"\", MATCH(R8, data!$B$7:$B$988, 0))","v":24},{"$f":"IF(Q8=\"\", \"\", 2*MATCH(Q8, calc!$R$7:$R$23, 0)-1)","v":1},null,{"$f":"IF(OR(D8=\"\", $T8=\"\"), \"\", ($S8-1) + MATCH(D8, OFFSET(data!$B$6, $S8, $T8+2*V$6, 500, 1), 0))","v":24},{"$f":"IF(OR(E8=\"\", $T8=\"\"), \"\", ($S8-1) + MATCH(E8, OFFSET(data!$B$6, $S8, $T8+2*W$6, 500, 1), 0))","v":27},{"$f":"IF(OR(F8=\"\", $T8=\"\"), \"\", ($S8-1) + MATCH(F8, OFFSET(data!$B$6, $S8, $T8+2*X$6, 500, 1), 0))","v":30},{"$f":"IF(OR(G8=\"\", $T8=\"\"), \"\", ($S8-1) + MATCH(G8, OFFSET(data!$B$6, $S8, $T8+2*Y$6, 500, 1), 0))","v":32},{"$f":"IF(OR(H8=\"\", $T8=\"\"), \"\", ($S8-1) + MATCH(H8, OFFSET(data!$B$6, $S8, $T8+2*Z$6, 500, 1), 0))","v":33},{"$f":"IF(OR(I8=\"\", $T8=\"\"), \"\", ($S8-1) + MATCH(I8, OFFSET(data!$B$6, $S8, $T8+2*AA$6, 500, 1), 0))","v":36},{"$f":"IF(OR(J8=\"\", $T8=\"\"), \"\", ($S8-1) + MATCH(J8, OFFSET(data!$B$6, $S8, $T8+2*AB$6, 500, 1), 0))","v":39},{"$f":"IF(OR(K8=\"\", $T8=\"\"), \"\", ($S8-1) + MATCH(K8, OFFSET(data!$B$6, $S8, $T8+2*AC$6, 500, 1), 0))","v":""},{"$f":"IF(OR(L8=\"\", $T8=\"\"), \"\", ($S8-1) + MATCH(L8, OFFSET(data!$B$6, $S8, $T8+2*AD$6, 500, 1), 0))","v":""}]
[null,"2017-03-31","NBF","2017-03-17","2017-04-14","2017-04-14","2017-04-14","2017-04-14","2017-04-14","2017-04-14","",null,null,null,null,"2017-03-31",{"$f":"IF(P9=\"\", \"\", IF(ISERROR(OFFSET(calc!$R$6, MATCH(P9, calc!$S$7:$S$18, 0), 0)), \"\",  OFFSET(calc!$R$6, MATCH(P9, calc!$S$7:$S$18, 0), 0)))","v":"Q117"},"NBF",{"$f":"IF(R9=\"\", \"\", MATCH(R9, data!$B$7:$B$988, 0))","v":45},{"$f":"IF(Q9=\"\", \"\", 2*MATCH(Q9, calc!$R$7:$R$23, 0)-1)","v":1},null,{"$f":"IF(OR(D9=\"\", $T9=\"\"), \"\", ($S9-1) + MATCH(D9, OFFSET(data!$B$6, $S9, $T9+2*V$6, 500, 1), 0))","v":45},{"$f":"IF(OR(E9=\"\", $T9=\"\"), \"\", ($S9-1) + MATCH(E9, OFFSET(data!$B$6, $S9, $T9+2*W$6, 500, 1), 0))","v":47},{"$f":"IF(OR(F9=\"\", $T9=\"\"), \"\", ($S9-1) + MATCH(F9, OFFSET(data!$B$6, $S9, $T9+2*X$6, 500, 1), 0))","v":50},{"$f":"IF(OR(G9=\"\", $T9=\"\"), \"\", ($S9-1) + MATCH(G9, OFFSET(data!$B$6, $S9, $T9+2*Y$6, 500, 1), 0))","v":53},{"$f":"IF(OR(H9=\"\", $T9=\"\"), \"\", ($S9-1) + MATCH(H9, OFFSET(data!$B$6, $S9, $T9+2*Z$6, 500, 1), 0))","v":55},{"$f":"IF(OR(I9=\"\", $T9=\"\"), \"\", ($S9-1) + MATCH(I9, OFFSET(data!$B$6, $S9, $T9+2*AA$6, 500, 1), 0))","v":57},{"$f":"IF(OR(J9=\"\", $T9=\"\"), \"\", ($S9-1) + MATCH(J9, OFFSET(data!$B$6, $S9, $T9+2*AB$6, 500, 1), 0))","v":61},{"$f":"IF(OR(K9=\"\", $T9=\"\"), \"\", ($S9-1) + MATCH(K9, OFFSET(data!$B$6, $S9, $T9+2*AC$6, 500, 1), 0))","v":""},{"$f":"IF(OR(L9=\"\", $T9=\"\"), \"\", ($S9-1) + MATCH(L9, OFFSET(data!$B$6, $S9, $T9+2*AD$6, 500, 1), 0))","v":""}]
[null,"2017-03-31","BNS","2017-03-17","2017-04-14","2017-04-14","2017-04-14","2017-04-14","2017-04-14","2017-04-14","",null,null,null,null,"2017-03-31",{"$f":"IF(P10=\"\", \"\", IF(ISERROR(OFFSET(calc!$R$6, MATCH(P10, calc!$S$7:$S$18, 0), 0)), \"\",  OFFSET(calc!$R$6, MATCH(P10, calc!$S$7:$S$18, 0), 0)))","v":"Q117"},"BNS",{"$f":"IF(R10=\"\", \"\", MATCH(R10, data!$B$7:$B$988, 0))","v":68},{"$f":"IF(Q10=\"\", \"\", 2*MATCH(Q10, calc!$R$7:$R$23, 0)-1)","v":1},null,{"$f":"IF(OR(D10=\"\", $T10=\"\"), \"\", ($S10-1) + MATCH(D10, OFFSET(data!$B$6, $S10, $T10+2*V$6, 500, 1), 0))","v":68},{"$f":"IF(OR(E10=\"\", $T10=\"\"), \"\", ($S10-1) + MATCH(E10, OFFSET(data!$B$6, $S10, $T10+2*W$6, 500, 1), 0))","v":70},{"$f":"IF(OR(F10=\"\", $T10=\"\"), \"\", ($S10-1) + MATCH(F10, OFFSET(data!$B$6, $S10, $T10+2*X$6, 500, 1), 0))","v":73},{"$f":"IF(OR(G10=\"\", $T10=\"\"), \"\", ($S10-1) + MATCH(G10, OFFSET(data!$B$6, $S10, $T10+2*Y$6, 500, 1), 0))","v":76},{"$f":"IF(OR(H10=\"\", $T10=\"\"), \"\", ($S10-1) + MATCH(H10, OFFSET(data!$B$6, $S10, $T10+2*Z$6, 500, 1), 0))","v":79},{"$f":"IF(OR(I10=\"\", $T10=\"\"), \"\", ($S10-1) + MATCH(I10, OFFSET(data!$B$6, $S10, $T10+2*AA$6, 500, 1), 0))","v":82},{"$f":"IF(OR(J10=\"\", $T10=\"\"), \"\", ($S10-1) + MATCH(J10, OFFSET(data!$B$6, $S10, $T10+2*AB$6, 500, 1), 0))","v":85},{"$f":"IF(OR(K10=\"\", $T10=\"\"), \"\", ($S10-1) + MATCH(K10, OFFSET(data!$B$6, $S10, $T10+2*AC$6, 500, 1), 0))","v":""},{"$f":"IF(OR(L10=\"\", $T10=\"\"), \"\", ($S10-1) + MATCH(L10, OFFSET(data!$B$6, $S10, $T10+2*AD$6, 500, 1), 0))","v":""}]
{"$rows_left_out":127}
{"sheet":"test","index":7,"n_rows":129,"n_cols":33,"rows_kept":129,"cut":false,"hidden":false,"merged":[]}
[]
[null,"TAB: SAMPLE TESTING"]
[null,null,null,null,null,null,null,null,null,null,null,null,null,null,null,null,null,null,null,null,null,null,null,null,null,null,null,null,null,null,"Sample size"]
[null,"Sample view as of issue date",null,null,null,null,null,null,"Key ids",null,null,null,null,null,null,"Sample view as of maturity date",null,null,null,null,null,null,{"$f":"I4","v":"Key ids"},null,null,null,null,null,null,null,"key","level","size"]
[null,{"$f":"config!I29","v":"field-key"},null,null,{"$f":"config!I32","v":"forecast-value"},null,null,null,{"$f":"config!$I$33","v":"forecaster-id"},null,null,null,null,null,null,{"$f":"B5","v":"field-key"},null,null,{"$f":"E5","v":"forecast-value"},null,null,null,{"$f":"I5","v":"forecaster-id"},null,null,null,null,null,null,null,{"$f":"config!I35","v":"maturity"},{"$f":"_xll.AC.stats.sample.size(calc!F13, -1)","v":0},8]
[null,{"$f":"config!$I$20","v":"values-only"},null,null,0,null,null,null,{"$f":"config!$I$30","v":"issue-date"},null,null,null,null,null,null,"values-only",null,null,{"$f":"E6","v":0},null,null,null,{"$f":"config!I36","v":"maturity-date"},null,null,null,null,null,null,null,{"$f":"config!I30","v":"issue-date"},1,13]
[null,{"$f":"config!$I$23","v":"key-ids-row"},null,null,{"$f":"_xll.AC.data.list_x(I6:I7, 0, 1)","v":"java.util.ArrayList@Sun, 4 Nov 2018 07:46:59:000..8083850872994397153"},null,null," ",{"$f":"config!$I$35","v":"maturity"},null,null,null,null,null,null,"key-ids-row",null,null,{"$f":"_xll.AC.data.list_x(W6:W7, 0, 1)","v":"java.util.ArrayList@Sun, 4 Nov 2018 07:46:58:999..8779135558661952785"},null,null," ",{"$f":"I7","v":"maturity"},null,null,null,null,null,null,null,{"$f":"config!I33","v":"forecaster-id"},2,10]
[null,{"$f":"config!$I$24","v":"key-ids-col"},null,null,{"$f":"_xll.AC.data.list_x(I5, 0, 1)","v":"java.util.ArrayList@Sun, 4 Nov 2018 07:46:58:999..4417937999053597343"},null,null," ",null,null,null,null,null,null,null,"key-ids-col",null,null,{"$f":"_xll.AC.data.list_x(W5, 0, 1)","v":"java.util.ArrayList@Sun, 4 Nov 2018 07:46:58:999..4417937999053597343"},null,null," "]
[null,{"$f":"config!$I$26","v":"table-header-names"},null,null,{"$f":"_xll.AC.data.list_x(I11:I12, 0, 1)","v":"java.util.ArrayList@Sun, 4 Nov 2018 07:46:59:000..299407659907189834"},null,null," ",null,null,null,null,null,null,null,"table-header-names",null,null,{"$f":"_xll.AC.data.list_x(W11:W12, 0, 1)","v":"java.util.ArrayList@Sun, 4 Nov 2018 07:46:59:000..5065415558509924800"},null,null," ",null,null,null,null,null,null,null,null,"total",null,{"$f":"AG5*AG6*AG7","v":1040}]
[null,{"$f":"config!I37","v":"log-level-debug"},null,null,0,null,null,null,"Column names",null,null,null,null,null,null,"log-level-debug",null,null,1,null,null,null,{"$f":"I10","v":"Column names"}]
{"$rows_left_out":120}
{"sheet":"config","index":8,"n_rows":40,"n_cols":12,"rows_kept":40,"cut":false,"hidden":false,"merged":[]}
[]
[null,"TAB: CONFIGURATION FILE"]
[]
[null,"Test connection",{"$f":"_xll.AC.test.connection()","v":"host: CA2013466W3; user: Konstantin.Rybakov; key: null"},null,null,null,null,null,"Enable calculations",true]
[]
[null,"Array formula cell address","number of rows","number of \ncols","Description",null,null,null,"Parameter","Description"]
[null,{"$f":"addressFla(hist!#REF!)","v":{"$error":"#VALUE!"}},{"$f":"hist!#REF!","v":{"$error":"#REF!"}},{"$f":"hist!#REF!","v":{"$error":"#REF!"}},"Forecast sample as of forecast issue date",null,null,null,"Statistics","Sample statistics","Data types","Sample key data types"]
[null,{"$f":"addressFla(hist!G7)","v":"'hist'!$G$7"},{"$f":"hist!K4","v":12},{"$f":"hist!L4","v":11},"Forecast sample as of forecast maturity date",null,null,null,"min",null,"date"]
[null,{"$f":"addressFla(hist!#REF!)","v":{"$error":"#VALUE!"}},{"$f":"hist!#REF!","v":{"$error":"#REF!"}},{"$f":"hist!#REF!","v":{"$error":"#REF!"}},"Forecast sample with different maturities",null,null,null,"max",null,"int"]
[null,{"$f":"addressFla(current!B14)","v":"'current'!$B$14"},{"$f":"current!F5","v":11},{"$f":"current!G5","v":8},null,null,null,null,"mean",null,"double"]
{"$rows_left_out":31}
{"sheet":"guide","index":9,"n_rows":2,"n_cols":2,"rows_kept":2,"cut":false,"hidden":false,"merged":[[1,1,32,8]]}
[]
[null,"Package: AC.stats.sample\n\nShort cut key combinations: \nCtrl+Shft+C - calculate all; Ctrl+Shift+R - refresh addin; Ctrl+Shft+S - set the data ranges; \nCtrl+Shft+D - disable calculations; Ctrl+Shft+G - update graphs, Ctrl+Shft+H - highlight the graph used as a reference\n\nECFC Bloomberg tool\n\n1. Run ECFC function on Bloomberg terminal;\n2. Select Country/Region and Contributor. Select quarterly data frequency\n3. The following conventions are used. Suppose that the forecast series is ECUPUS Q116 BM Index. Then the data tab has the ECUPUS series name in the upper-left corner, the columns are titled as Q*** (e.g. Q116, depending on the year and the quarter), and the contributor is named as BM. Each line with forecast data must have contributor abbreviation in the related column;\n4. Drag the variable value into a separate Bloomberg window to display the related series. Use GP function to show series graph data. Copy the data from the graph directly into the Excel \"data\" tab;\n5. Change the quarter in the data series and review the range of dates selected by Bloomberg for the series. When you review the data range for each quarterly series, check that the last date is close or after the quarter end. Set the first date to approximately 2-3 years prior to the quarter end (Bloomberg will update it automatically to the earliest date with available data);\n6. If the series is shown as unavailable, it is likely that the data for a specific date range is not found. Try to select some earlier starting date for the range;\n7. Uncheck Mov Avgs or other checkbox if necessary;\n8. Copy historical data from Bloomberg into respective \"historical\" tab. Verify that historical data series in the \"stats\" tab is linked to correct historical data series. To identify the correct ticker for the historical data series, move the mouse over respective historical values of the variable in the ECFC screen.\n\nSurvey of Professional Forecasters (SPF)\n\n\n\n\n"]