{"text_format":"1","workbook":"xlsx","n_sheets":11,"sheets":["guide","calc","project","backtrack","impulse","charts","data, adj","data","fitted","res","config"],"not_rendered":{"charts":11,"images":0,"macros":1,"external_links":0,"defined_names":13,"comments":0,"pivot_tables":0},"unopened":[],"bounds":{"document_bytes":16777216,"sheet_cells":100000,"rows_first":2000,"rows_last":500,"rows_between":2000,"halvings":0,"cell_chars":16384,"cell_head_chars":4096},"cells_cut":0,"cells_raw":0,"read":"whole","date_system":"1900"}

{"sheet":"guide","index":0,"n_rows":2,"n_cols":2,"rows_kept":2,"cut":false,"hidden":false,"merged":[[1,1,32,8]]}
[]
[null,"Package: ac.stats.var\n\nAvailable functions for term structure estimation:\n"]

{"sheet":"calc","index":1,"n_rows":171,"n_cols":22,"rows_kept":171,"cut":false,"hidden":false,"merged":[]}
[]
[null,"TAB: VAR REGRESSION CALCULATOR"]
[]
[null,"A. Inputs and  Calculator:",null,null,null,null,null,null,null,null," "]
[]
[null,"parameters",null,null,null,null,null,null,null,null,null,"Parameter","Date","Value",null,"Parameter",null,"Value"]
[null,"add-constant",1,null,{"$f":"_xll.AC.data.map(B7:B7, C7:C7)","v":"java.util.LinkedHashMap@Tue, 23 Jan 2018 21:43:35:819..940910025344908797"},null,null,null,null,null," ","End date",{"$f":"'data, adj'!B29","v":"2017-06-30"},{"$f":"MATCH(M7, 'data, adj'!B7:B118, 0)","v":23}]
[null,null,null,null,null,null,null,null,null,null," ","Start date",{"$f":"OFFSET('data, adj'!B6, N8, 0)","v":"1997-06-30"},{"$f":"R8+N7","v":103},null,"Sample size",null,{"$f":"COUNT('data, adj'!B35:B114)","v":80}]
{"$rows_left_out":164}
{"sheet":"project","index":2,"n_rows":51,"n_cols":34,"rows_kept":51,"cut":false,"hidden":false,"merged":[]}
[]
[null,"TAB: PROJECTED VALUES, 90% CONFIDENCE BAND",null,null,null,null,null,null,null,null,null,null,null,null,null,null,null,null,null,{"$f":"COLUMNS('data, adj'!B6:F6)","v":5},{"$f":"T2+1","v":6},{"$f":"U2+1","v":7},8,9,10,11,null,{"$f":"NORMINV(0.95, 0, 1)","v":1.6448536269514715}]
[null,null,null,null,null,null,null,null,null,null,null,null,null,null,null,null,null,null,null,"Average values",null,null,null,null,null,null,null,"Lower bound"]
[null,"Projections - value",null,null,null,null,null,null,null,null,"Cumulative projections - value",null,null,null,null,null,null,null,null,"Average projected cumulative values",null,null,null,null,null,null,null,"Lower range of projected cumulative values"]
[null,"Date",{"$f":"calc!M17","v":"CA"},{"$f":"calc!N17","v":"AB"},{"$f":"calc!O17","v":"BC"},{"$f":"calc!P17","v":"MB"},{"$f":"calc!Q17","v":"ON"},{"$f":"calc!R17","v":"QC"},{"$f":"calc!S17","v":"SK"},null,{"$f":"B5","v":"Date"},{"$f":"C5","v":"CA"},{"$f":"D5","v":"AB"},"BC","MB","ON","QC","SK",null,{"$f":"L5","v":"CA"},{"$f":"M5","v":"AB"},"BC","MB","ON","QC","SK",null,{"$f":"L5","v":"CA"},"AB","BC","MB","ON","QC","SK"]
[null,{"$f":"calc!M7","v":"2017-06-30"},{"$f":"_xll.AC.stats.reg._get(calc!B11, config!B12, 0)","v":8.6355900218340054E-3},1.6150503819027051E-2,0.1137734067698748,-5.3246224918748197E-3,-5.624844223644665E-2,1.6558944443037404E-2,1.1871694328631222E-2,null,{"$f":"B6","v":"2017-06-30"},{"$f":"_xll.AC.stats.reg._get(calc!B11, config!B13, 0)","v":0},0,0,0,0,0,0,null,{"$f":"VLOOKUP($K6, 'data, adj'!$B$7:$S$118, T$2, FALSE)","v":13.148941041436601},{"$f":"VLOOKUP($K6, 'data, adj'!$B$7:$S$118, U$2, FALSE)","v":12.903841629085189},{"$f":"VLOOKUP($K6, 'data, adj'!$B$7:$S$118, V$2, FALSE)","v":13.481467568331881},{"$f":"VLOOKUP($K6, 'data, adj'!$B$7:$S$118, W$2, FALSE)","v":12.557239950230489},{"$f":"VLOOKUP($K6, 'data, adj'!$B$7:$S$118, X$2, FALSE)","v":13.274380353933427},{"$f":"VLOOKUP($K6, 'data, adj'!$B$7:$S$118, Y$2, FALSE)","v":12.597273163069067},{"$f":"VLOOKUP($K6, 'data, adj'!$B$7:$S$118, Z$2, FALSE)","v":12.592878072929793},null,{"$f":"T6","v":13.148941041436601},{"$f":"U6","v":12.903841629085189},13.481467568331881,12.557239950230489,13.274380353933427,12.597273163069067,12.592878072929793]
[null,{"$f":"DATE(YEAR(B6), MONTH(B6)+4, 0)","v":"2017-09-30"},2.1475604191746937E-2,1.6348281703988912E-2,2.10800938131653E-2,3.9370924768499335E-2,1.4454134395063488E-2,1.4168416692032393E-2,2.5124914807563549E-2,null,{"$f":"B7","v":"2017-09-30"},8.6355900218340054E-3,1.6150503819027051E-2,0.1137734067698748,-5.3246224918748197E-3,-5.624844223644665E-2,1.6558944443037404E-2,1.1871694328631222E-2,null,{"$f":"T$6+L7","v":13.157576631458435},{"$f":"U$6+M7","v":12.919992132904216},{"$f":"V$6+N7","v":13.595240975101756},{"$f":"W$6+O7","v":12.551915327738614},{"$f":"X$6+P7","v":13.218131911696981},{"$f":"Y$6+Q7","v":12.613832107512104},{"$f":"Z$6+R7","v":12.604749767258424},null,{"$f":"T7-$AB$2*SQRT(L31)","v":13.127650249391344},{"$f":"U7-$AB$2*SQRT(M31)","v":12.89100761329162},{"$f":"V7-$AB$2*SQRT(N31)","v":13.545273233781002},{"$f":"W7-$AB$2*SQRT(O31)","v":12.519136423027593},{"$f":"X7-$AB$2*SQRT(P31)","v":13.184003320009348},{"$f":"Y7-$AB$2*SQRT(Q31)","v":12.591029972796848},{"$f":"Z7-$AB$2*SQRT(R31)","v":12.568766340873458}]
[null,"2017-12-31",2.0280943121640773E-2,1.9269607252283657E-2,2.627902726045624E-2,1.153744042516661E-2,2.0561135908677631E-2,1.2776774506773315E-2,2.0276608132415892E-2,null,"2017-12-31",3.0111194213580942E-2,3.2498785523015966E-2,0.1348535005830401,3.4046302276624515E-2,-4.179430784138316E-2,3.0727361135069797E-2,3.699660913619477E-2,null,{"$f":"T$6+L8","v":13.179052235650181},12.936340414608205,13.616321068914921,12.591286252507114,13.232586046092043,12.628000524204136,12.629874682065987,null,13.125563891932179,12.881443976100286,13.53061209265093,12.546384951686113,13.180705330064113,12.591530084586653,12.565286813395817]
{"$rows_left_out":44}
{"sheet":"backtrack","index":3,"n_rows":85,"n_cols":45,"rows_kept":85,"cut":false,"hidden":false,"merged":[]}
[]
[null,"TAB: IN-SAMPLE BACKTESTING OF THE DATA",null,null,null,null,null,null,null,null,null,null,"Variance",{"$f":"OFFSET(project!L30, $P$4, 0)","v":3.0567911255494416E-3},{"$f":"OFFSET(project!M30, $P$4, 0)","v":4.0706062547906261E-3},{"$f":"OFFSET(project!N30, $P$4, 0)","v":7.5937066462133107E-3},{"$f":"OFFSET(project!O30, $P$4, 0)","v":1.7497478919730673E-3},{"$f":"OFFSET(project!P30, $P$4, 0)","v":2.2089727048782279E-3},{"$f":"OFFSET(project!Q30, $P$4, 0)","v":1.2217520231564186E-3},{"$f":"OFFSET(project!R30, $P$4, 0)","v":4.4987276708609823E-3},null,null,null,null,null,null,"quantile",null,{"$f":"NORMINV(0.95, 0, 1)","v":1.6448536269514715},null,null,null,null,null,null,null,null,null,null,null,null,null,null,null,{"$f":"COUNT(AS7:AS500)","v":75}]
[null,null,null,null,null,null,null,null,null,null,null,null,null,null,null,null,null,null,null,null,null,null,null,null,null,null,null,null,null,null,null,null,null,null,null,null,null,null,null,null,null,null,null,null,{"$f":"SUMPRODUCT(AS7:AS81, AS7:AS81)","v":0.28385770699236346}]
[null,null,"Actual data",null,{"$f":"AVERAGE(E7:E500)","v":12.521703463482412},12.466651893536797,12.84803339023289,11.977144390872548,12.578117576078039,12.150758061728455,12.028253525144958,null,"Projected Data",null,"T",4,null,null,null,null,null,3,{"$f":"V4+1","v":4},{"$f":"W4+1","v":5},6,7,8,9,null,null,null,null,null,null,null,null,null,null,null,null,null,null,null,null,{"$f":"SQRT(AS3/AS2)","v":6.1520479732889329E-2}]
[null,null,null,"Actual values",{"$f":"COLUMNS('data, adj'!$B6:F6)","v":5},{"$f":"COLUMNS('data, adj'!$B6:G6)","v":6},{"$f":"COLUMNS('data, adj'!$B6:H6)","v":7},{"$f":"COLUMNS('data, adj'!$B6:I6)","v":8},{"$f":"COLUMNS('data, adj'!$B6:J6)","v":9},{"$f":"COLUMNS('data, adj'!$B6:K6)","v":10},{"$f":"COLUMNS('data, adj'!$B6:L6)","v":11},null,null,"Projected cumulative values",null,null,null,null,null,null,null,"Average values",null,null,null,null,null,null,"Lower bound",null,null,null,null,null,null,"Upper bound",null,null,null,null,null,null,null,null,{"$f":"AS4/E4","v":4.9131078620655872E-3}]
[null,"#","Actuial Date","Forecast Date",{"$f":"'data, adj'!F6","v":"CA"},{"$f":"'data, adj'!G6","v":"AB"},{"$f":"'data, adj'!H6","v":"BC"},{"$f":"'data, adj'!I6","v":"MB"},{"$f":"'data, adj'!J6","v":"ON"},{"$f":"'data, adj'!K6","v":"QC"},{"$f":"'data, adj'!L6","v":"SK"},null,"Forecast Date",{"$f":"E6","v":"CA"},"AB","BC","MB","ON","QC","SK",null,{"$f":"N6","v":"CA"},{"$f":"O6","v":"AB"},"BC","MB","ON","QC","SK",{"$f":"V6","v":"CA"},{"$f":"W6","v":"AB"},"BC","MB","ON","QC","SK","CA","AB","BC","MB","ON","QC","SK",null,null,{"$f":"AJ6","v":"CA"}]
[null,1,{"$f":"calc!M7","v":"2017-06-30"},{"$f":"OFFSET(C7, $P$4, 0)","v":"2016-06-30"},{"$f":"VLOOKUP($C7, 'data, adj'!$B$7:$S$118, E$5, FALSE)","v":13.148941041436601},{"$f":"VLOOKUP($C7, 'data, adj'!$B$7:$S$118, F$5, FALSE)","v":12.903841629085189},{"$f":"VLOOKUP($C7, 'data, adj'!$B$7:$S$118, G$5, FALSE)","v":13.481467568331881},{"$f":"VLOOKUP($C7, 'data, adj'!$B$7:$S$118, H$5, FALSE)","v":12.557239950230489},{"$f":"VLOOKUP($C7, 'data, adj'!$B$7:$S$118, I$5, FALSE)","v":13.274380353933427},{"$f":"VLOOKUP($C7, 'data, adj'!$B$7:$S$118, J$5, FALSE)","v":12.597273163069067},{"$f":"VLOOKUP($C7, 'data, adj'!$B$7:$S$118, K$5, FALSE)","v":12.592878072929793},null,{"$f":"C7","v":"2017-06-30"},{"$f":"_xll.AC.stats.reg._get(calc!B11, config!B16, 0)","v":5.0392137335221715E-2},5.1768392775299626E-2,0.16113252784349635,4.5583742701791122E-2,-2.1233171932705529E-2,4.3504135641843113E-2,5.7273217268610663E-2,null,{"$f":"OFFSET(E7, $P$4, 0) + OFFSET(N7, $P$4, 0)","v":13.120806046040583},{"$f":"OFFSET(F7, $P$4, 0) + OFFSET(O7, $P$4, 0)","v":12.909852425766159},{"$f":"OFFSET(G7, $P$4, 0) + OFFSET(P7, $P$4, 0)","v":13.435414550441852},{"$f":"OFFSET(H7, $P$4, 0) + OFFSET(Q7, $P$4, 0)","v":12.519609630402392},{"$f":"OFFSET(I7, $P$4, 0) + OFFSET(R7, $P$4, 0)","v":13.219865991747923},{"$f":"OFFSET(J7, $P$4, 0) + OFFSET(S7, $P$4, 0)","v":12.581248873833415},{"$f":"OFFSET(K7, $P$4, 0) + OFFSET(T7, $P$4, 0)","v":12.606254639108315},{"$f":"V7 - SQRT(N$2)*$AC$2","v":13.029864959505028},{"$f":"W7 - SQRT(O$2)*$AC$2","v":12.80490862124751},{"$f":"X7 - SQRT(P$2)*$AC$2","v":13.292078918762275},{"$f":"Y7 - SQRT(Q$2)*$AC$2","v":12.450805423006006},{"$f":"Z7 - SQRT(R$2)*$AC$2","v":13.142558348904808},{"$f":"AA7 - SQRT(S$2)*$AC$2","v":12.523755368210791},{"$f":"AB7 - SQRT(T$2)*$AC$2","v":12.495930103298479},{"$f":"V7 + SQRT(N$2)*$AC$2","v":13.211747132576138},{"$f":"W7 + SQRT(O$2)*$AC$2","v":13.014796230284809},{"$f":"X7 + SQRT(P$2)*$AC$2","v":13.578750182121428},{"$f":"Y7 + SQRT(Q$2)*$AC$2","v":12.588413837798779},{"$f":"Z7 + SQRT(R$2)*$AC$2","v":13.297173634591038},{"$f":"AA7 + SQRT(S$2)*$AC$2","v":12.638742379456039},{"$f":"AB7 + SQRT(T$2)*$AC$2","v":12.71657917491815},null,null,{"$f":"V7-E7","v":-2.8134995396017715E-2}]
[null,{"$f":"B7+1","v":2},{"$f":"DATE(YEAR(C7), MONTH(C7)-2, 0)","v":"2017-03-31"},{"$f":"OFFSET(C8, $P$4, 0)","v":"2016-03-31"},{"$f":"VLOOKUP($C8, 'data, adj'!$B$7:$S$118, E$5, FALSE)","v":13.140305451414767},{"$f":"VLOOKUP($C8, 'data, adj'!$B$7:$S$118, F$5, FALSE)","v":12.887691125266162},{"$f":"VLOOKUP($C8, 'data, adj'!$B$7:$S$118, G$5, FALSE)","v":13.367694161562007},{"$f":"VLOOKUP($C8, 'data, adj'!$B$7:$S$118, H$5, FALSE)","v":12.562564572722364},{"$f":"VLOOKUP($C8, 'data, adj'!$B$7:$S$118, I$5, FALSE)","v":13.330628796169874},{"$f":"VLOOKUP($C8, 'data, adj'!$B$7:$S$118, J$5, FALSE)","v":12.58071421862603},{"$f":"VLOOKUP($C8, 'data, adj'!$B$7:$S$118, K$5, FALSE)","v":12.581006378601161},null,{"$f":"C8","v":"2017-03-31"},8.6338242043343477E-2,1.8503113746772694E-2,4.5518686512640877E-2,3.6883188856504448E-2,0.12179785778842409,4.338660432682797E-2,3.2788580675786015E-4,null,13.228248563310318,12.886186402411928,13.670167906696069,12.590490258482919,13.223092612711454,12.587411389822332,12.584487700566152,13.137307476774764,12.781242597893279,13.526832275016492,12.521686051086533,13.145784969868339,12.529917884199708,12.474163164756316,13.319189649845873,12.991130206930578,13.813503538375645,12.659294465879306,13.300400255554569,12.644904895444956,12.694812236375988,null,null,8.7943111895551596E-2]
{"$rows_left_out":78}
{"sheet":"impulse","index":4,"n_rows":43,"n_cols":9,"rows_kept":43,"cut":false,"hidden":false,"merged":[]}
[]
[null,"TAB: IMPULSE RESPONSE SERIES"]
[]
[null,"Impulse response parameters"]
[]
[]
[null,"Initial state"]
[null,"Change in the state",null,null,null,null,0,0,0.5]
{"$rows_left_out":36}
{"sheet":"charts","index":5,"n_rows":19,"n_cols":2,"rows_kept":19,"cut":false,"hidden":false,"merged":[]}
[]
[null,"TAB: CHARTS"]
[]
[null,"Backtesting / projection"]
[]
[]
[]
[]
{"$rows_left_out":12}
{"sheet":"data, adj","index":6,"n_rows":118,"n_cols":19,"rows_kept":118,"cut":false,"hidden":false,"merged":[]}
[]
[null,null,null,null,null,{"$f":"\"ln \"& data!E4","v":"ln CREA Home Prices"},null,null,null,null,null,null,{"$f":"\"d \" &F2","v":"d ln CREA Home Prices"}]
[]
[null,null,null,null,null,{"$f":"COLUMNS(data!$B6:E6)","v":4},{"$f":"COLUMNS(data!$B6:F6)","v":5},{"$f":"COLUMNS(data!$B6:G6)","v":6},{"$f":"COLUMNS(data!$B6:H6)","v":7},{"$f":"COLUMNS(data!$B6:I6)","v":8},{"$f":"COLUMNS(data!$B6:J6)","v":9},{"$f":"COLUMNS(data!$B6:K6)","v":10}]
[null,null,null,null,{"$f":"COUNTA(E7:E34)","v":28},{"$f":"(F7-F35)/$E$5","v":8.4891129817707012E-3},{"$f":"(G7-G35)/$E$5","v":5.8765383963950467E-3},7.8015319897744339E-3,1.1472703089735374E-2,1.035595935290244E-2,8.453187506572122E-3,4.3816279451718921E-3]
[null,"Date","Year","Quarter","Period",{"$f":"data!E6","v":"CA"},{"$f":"data!F6","v":"AB"},{"$f":"data!G6","v":"BC"},{"$f":"data!H6","v":"MB"},{"$f":"data!I6","v":"ON"},{"$f":"data!J6","v":"QC"},{"$f":"data!K6","v":"SK"},{"$f":"F6","v":"CA"},{"$f":"G6","v":"AB"},"BC","MB","ON","QC","SK"]
[null,"2022-12-31",{"$f":"YEAR(B7)","v":2022},{"$f":"\"Q\" & (MONTH(B7)/3)","v":"Q4"},{"$f":"C7 & D7","v":"2022Q4"},{"$f":"LN(VLOOKUP($E7, data!$B$8:$K$139, F$4, FALSE))","v":13.281281531885769},{"$f":"LN(VLOOKUP($E7, data!$B$8:$K$139, G$4, FALSE))","v":13.038614309656211},{"$f":"LN(VLOOKUP($E7, data!$B$8:$K$139, H$4, FALSE))","v":13.6636184922135},{"$f":"LN(VLOOKUP($E7, data!$B$8:$K$139, I$4, FALSE))","v":12.80912825562597},{"$f":"LN(VLOOKUP($E7, data!$B$8:$K$139, J$4, FALSE))","v":13.357795908936859},{"$f":"LN(VLOOKUP($E7, data!$B$8:$K$139, K$4, FALSE))","v":12.768068456106288},{"$f":"LN(VLOOKUP($E7, data!$B$8:$K$139, L$4, FALSE))","v":12.722673560152691},{"$f":"F7-F8","v":1.0405050248747827E-2},{"$f":"G7-G8","v":1.181294376315023E-2},{"$f":"H7-H8","v":1.2084396019522714E-2},{"$f":"I7-I8","v":1.4830152588345413E-2},{"$f":"J7-J8","v":8.3336130069895376E-3},{"$f":"K7-K8","v":8.1969079622563612E-3},{"$f":"L7-L8","v":1.0515507954769632E-2}]
[null,{"$f":"DATE(YEAR(B7), MONTH(B7)-2, 0)","v":"2022-09-30"},{"$f":"YEAR(B8)","v":2022},{"$f":"\"Q\" & (MONTH(B8)/3)","v":"Q3"},{"$f":"C8 & D8","v":"2022Q3"},{"$f":"LN(VLOOKUP($E8, data!$B$8:$K$139, F$4, FALSE))","v":13.270876481637021},{"$f":"LN(VLOOKUP($E8, data!$B$8:$K$139, G$4, FALSE))","v":13.026801365893061},{"$f":"LN(VLOOKUP($E8, data!$B$8:$K$139, H$4, FALSE))","v":13.651534096193977},{"$f":"LN(VLOOKUP($E8, data!$B$8:$K$139, I$4, FALSE))","v":12.794298103037624},{"$f":"LN(VLOOKUP($E8, data!$B$8:$K$139, J$4, FALSE))","v":13.34946229592987},{"$f":"LN(VLOOKUP($E8, data!$B$8:$K$139, K$4, FALSE))","v":12.759871548144032},{"$f":"LN(VLOOKUP($E8, data!$B$8:$K$139, L$4, FALSE))","v":12.712158052197921},{"$f":"F8-F9","v":1.0261867616456755E-2},1.1052623558995833E-2,1.1487065161215781E-2,1.441658391155265E-2,8.2252702864415994E-3,7.9112008434449876E-3,9.5189635293131403E-3]
{"$rows_left_out":111}
{"sheet":"data","index":7,"n_rows":139,"n_cols":11,"rows_kept":139,"cut":false,"hidden":false,"merged":[]}
[]
[null,"TAB: DATA (IN %)"]
[]
[null,null,null,null,"CREA Home Prices"]
[]
[null,"Period","Year","Quarter","CA","AB","BC","MB","ON","QC","SK"]
[]
[null,"1990Q1",{"$f":"MID(B8,1, 4)","v":"1990"},{"$f":"MID(B8, 5, 2)","v":"Q1"},145349,111565,162371,82270,177116,101559,71731]
{"$rows_left_out":132}
{"sheet":"fitted","index":8,"n_rows":85,"n_cols":9,"rows_kept":85,"cut":false,"hidden":false,"merged":[]}
[]
[null,"TAB: FITTED YIELD TERM STRUCTURE"]
[]
[null,"Fitted yields (in %)"]
[null,{"$f":"'data, adj'!B6","v":"Date"},{"$f":"'data, adj'!M6 & \" - fitted\"","v":"CA - fitted"},{"$f":"'data, adj'!N6 & \" - fitted\"","v":"AB - fitted"},{"$f":"'data, adj'!O6 & \" - fitted\"","v":"BC - fitted"},{"$f":"'data, adj'!P6 & \" - fitted\"","v":"MB - fitted"},{"$f":"'data, adj'!Q6 & \" - fitted\"","v":"ON - fitted"},{"$f":"'data, adj'!R6 & \" - fitted\"","v":"QC - fitted"},{"$f":"'data, adj'!S6 & \" - fitted\"","v":"SK - fitted"}]
[null,{"$f":"'data, adj'!B35","v":"2015-12-31"},{"$f":"_xll.AC.stats.reg._get(calc!B11, config!B11, 1)","v":"java.lang.ClassCastException: java.util.ArrayList cannot be cast to java.lang.Double"},"java.lang.ClassCastException: java.util.ArrayList cannot be cast to java.lang.Double","java.lang.ClassCastException: java.util.ArrayList cannot be cast to java.lang.Double","java.lang.ClassCastException: java.util.ArrayList cannot be cast to java.lang.Double","java.lang.ClassCastException: java.util.ArrayList cannot be cast to java.lang.Double","java.lang.ClassCastException: java.util.ArrayList cannot be cast to java.lang.Double","java.lang.ClassCastException: java.util.ArrayList cannot be cast to java.lang.Double"]
[null,{"$f":"'data, adj'!B36","v":"2015-09-30"},"java.lang.ClassCastException: java.util.ArrayList cannot be cast to java.lang.Double","java.lang.ClassCastException: java.util.ArrayList cannot be cast to java.lang.Double","java.lang.ClassCastException: java.util.ArrayList cannot be cast to java.lang.Double","java.lang.ClassCastException: java.util.ArrayList cannot be cast to java.lang.Double","java.lang.ClassCastException: java.util.ArrayList cannot be cast to java.lang.Double","java.lang.ClassCastException: java.util.ArrayList cannot be cast to java.lang.Double","java.lang.ClassCastException: java.util.ArrayList cannot be cast to java.lang.Double"]
[null,{"$f":"'data, adj'!B37","v":"2015-06-30"},"java.lang.ClassCastException: java.util.ArrayList cannot be cast to java.lang.Double","java.lang.ClassCastException: java.util.ArrayList cannot be cast to java.lang.Double","java.lang.ClassCastException: java.util.ArrayList cannot be cast to java.lang.Double","java.lang.ClassCastException: java.util.ArrayList cannot be cast to java.lang.Double","java.lang.ClassCastException: java.util.ArrayList cannot be cast to java.lang.Double","java.lang.ClassCastException: java.util.ArrayList cannot be cast to java.lang.Double","java.lang.ClassCastException: java.util.ArrayList cannot be cast to java.lang.Double"]
{"$rows_left_out":78}
{"sheet":"res","index":9,"n_rows":16,"n_cols":10,"rows_kept":16,"cut":false,"hidden":false,"merged":[]}
[]
[null,"TAB: COVARIANCE MATRICES OF THE VAR MODEL"]
[]
[null,"VAR residuals covariance matrix (Q, in bps)"]
[]
[null,null,null,1,{"$f":"D6+1","v":2},{"$f":"E6+1","v":3},4,5,6,7]
[null,"#",null,{"$f":"calc!D17","v":"CA"},{"$f":"calc!E17","v":"AB"},{"$f":"calc!F17","v":"BC"},{"$f":"calc!G17","v":"MB"},{"$f":"calc!H17","v":"ON"},{"$f":"calc!I17","v":"QC"},{"$f":"calc!J17","v":"SK"}]
[null,1,{"$f":"calc!B19","v":"CA"},{"$f":"_xll.AC.stats.reg._get(calc!B11, config!B20, 0)","v":3.3101975954953101E-4},9.8279544252030771E-5,3.6351232578075532E-4,8.7596476250434522E-5,2.2849942464873464E-4,6.1927683353856173E-5,3.4860981735250509E-5]
{"$rows_left_out":9}
{"sheet":"config","index":10,"n_rows":24,"n_cols":5,"rows_kept":24,"cut":false,"hidden":false,"merged":[]}
[]
[null,"TAB: CONFIGURATION FILE","Calculation enabled",null,true]
[]
[null,"Test connection",{"$f":"_xll.AC.test.connection()","v":"host: home-pc; user: Konstantin Rybakov; key: null"}]
[]
[null,"Term structure output keys"]
[null,"table-standard","Standard VAR output table"]
[null,"STATS","VAR model statistics"]
{"$rows_left_out":16}